program: Gaussian 09
title: 000150346
version: EM64L-G09RevD.01
frameworkgroup: C1[X(C17H16Cl2N2O2)]
method: RPBEPBE
basis: SDD
operation: Freq
keyword: #p
keyword: freq=noraman
keyword: PBEPBE/SDD
title: #p freq=noraman PBEPBE/SDD
converged: YES YES NO NO
title: Mulliken charges:
elementType: Cl Cl O O N N C C C C C C C C C C C C C C C C C H H H H H H H H H H H H H H H H
charge: -0.072166 -0.072170 -0.254964 -0.254993 -0.438301 -0.438325 -0.722118 0.551256 0.551187 -0.379986 -0.379827 -0.480853 -0.480888 0.582511 0.582331 -0.373499 -0.373461 -0.325885 -0.325803 0.224433 0.224573 -0.780047 -0.780034 0.234800 0.234692 0.270909 0.270861 0.239419 0.239450 0.315784 0.315826 0.309448 0.309454 0.258776 0.259471 0.219943 0.259172 0.259080 0.219943
chargesum: 0.00000
title: Mulliken charges with hydrogens summed into heavy atoms:
elementType: Cl Cl O O N N C C C C C C C C C C C C C C C C C
charge: -0.072166 -0.072170 -0.254964 -0.254993 -0.128852 -0.128871 -0.252626 0.551256 0.551187 -0.109077 -0.108966 -0.241434 -0.241437 0.582511 0.582331 -0.373499 -0.373461 -0.010101 -0.009976 0.224433 0.224573 -0.041857 -0.041839
polarizability: 3.51267055e+02 -3.58319975e-01 1.96270528e+02 -3.54307381e+01 -4.30185691e-02 1.76213998e+02
1716.lowfreq: -0.0001 0.0015 0.0017 0.8202 4.2837 6.3453 12.9753 13.2242 24.5522
frequency: 11.7104 12.9912 24.5494 44.2842 54.5258 65.6615 67.5820 69.3253 75.6992 112.1311 137.2025 161.1278 164.3711 165.4968 170.6973 197.3203 217.4494 268.8242 273.7335 317.2549 327.8562 361.6326 364.5025 398.9033 401.7543 433.2911 438.2868 439.9867 441.6242 506.8401 510.7283 561.0399 574.1835 600.0989 600.4468 626.9701 658.9847 669.9928 680.0086 688.5175 692.6771 729.5150 734.9259 794.3707 812.4465 845.6297 852.2001 869.6038 875.6873 879.1570 896.3902 936.3902 937.7763 955.8826 989.6052 991.0243 996.5289 996.7125 1029.7104 1030.1886 1041.2048 1041.2148 1134.6606 1143.5902 1187.4164 1194.9870 1212.1256 1225.0329 1225.4054 1253.6301 1254.7258 1288.3626 1304.4391 1315.6260 1367.6987 1369.8539 1390.7204 1390.8157 1408.4577 1409.1428 1449.7049 1450.0987 1455.6087 1466.4395 1469.5268 1470.1204 1474.1831 1512.1512 1516.4570 1568.9813 1574.2769 1618.1996 1619.2143 1628.4510 1629.8322 2973.9690 2997.7018 2997.8804 3020.1558 3097.6655 3099.1845 3100.9096 3102.3190 3131.9252 3132.1118 3156.6246 3156.9433 3188.9053 3189.0940 3493.3659 3493.3766
redmass: 7.1907 10.6474 6.8838 1.1717 1.4850 3.4288 3.3260 3.6387 3.5107 6.7362 5.0104 5.8081 4.8032 5.2224 6.8699 6.8023 4.9102 6.5397 4.4585 4.5635 5.4014 3.7064 7.2754 5.4845 4.8364 5.9951 4.9648 3.4970 3.4550 3.9662 4.1940 3.4814 4.0002 3.2911 3.2421 4.9377 5.8389 3.7728 6.6927 1.2632 1.3467 3.3657 3.6946 3.8958 4.5230 1.3782 2.3970 3.7222 1.6889 1.4849 1.8912 5.3796 6.4314 1.9985 1.3350 1.3721 1.6389 1.6393 2.8339 2.7331 1.6357 1.6358 1.5397 1.3883 1.1378 1.8307 1.5839 3.3302 3.2143 1.7614 1.4209 2.7655 1.9077 1.8658 4.2960 3.5640 1.2162 1.2161 3.7932 3.9992 1.0492 1.0452 1.3385 2.3579 1.1030 1.1000 1.7003 2.9705 2.9269 5.1517 5.2315 6.6021 6.4547 4.9402 5.0913 1.0599 1.0361 1.0361 1.1004 1.0986 1.0979 1.1009 1.1002 1.0911 1.0911 1.0925 1.0923 1.0943 1.0943 1.0766 1.0766
irintensity: 0.4285 0.2316 0.1415 1.7103 3.8824 9.6074 8.4400 1.2048 0.2101 0.5522 14.4890 0.7806 0.0449 0.2328 0.0706 0.1787 1.2398 0.4593 6.3505 0.3717 1.8087 0.4678 2.8163 9.9000 2.5760 4.2330 6.7891 14.3587 6.9747 16.4077 2.9880 16.7653 3.3739 0.3568 0.7518 9.2734 0.9201 44.8706 26.0629 49.5208 14.7057 19.0345 30.0251 0.6683 6.5408 81.2795 6.4600 4.7793 20.7989 3.2498 29.4349 12.9243 1.9858 27.9720 2.8359 2.7088 16.2545 12.1133 14.8738 25.8516 18.1407 12.0419 9.6290 3.0187 4.8141 0.5477 10.1488 141.1536 15.3205 18.4790 19.6486 49.1625 21.3380 147.0813 0.3907 315.7897 104.3120 27.2824 33.6675 15.7412 15.9717 15.3519 22.7003 143.7760 17.0433 19.1247 0.0577 970.2183 68.6080 121.2921 4.5564 166.0343 31.8021 56.4747 48.8203 26.4801 10.1133 10.2056 9.2818 9.8470 6.5442 18.0987 14.8124 13.6921 11.7618 1.4405 0.1213 11.4813 8.3292 27.9801 55.5588
temp: 298.150 k
press: 1.00000 atm
elementType: 17 17 8 8 7 7 6 6 6 6 6 6 6 6 6 6 6 6 6 6 6 6 6 1 1 1 1 1 1 1 1 1 1 1 1 1 1 1 1
symmnumber: 1
zpe: 772419.7 jmol-1
zpe.correction: 0.294199 hartree
zpe.thermalcorrener: 0.316960 hartree
zpe.thermalcorrenthalpy: 0.317904 hartree
zpe.thermalcorrgfe: 0.237306 hartree
zpe.sumelectzpe: -1835.882920 hartree
zpe.sumelectthermal: -1835.860159 hartree
zpe.sumelectthermalent: -1835.859215 hartree
zpe.sumelectthermalfe: -1835.939813 hartree
dipole: 0.0016 -2.0066 0.0060
dipole: 2.0066
quadrupole: -146.5886 -138.6764 -155.9312
quadrupole: 0.0909 21.3388 -0.0824
quadrupole: 0.4768 8.3890 -8.8659 0.0909 21.3388 -0.0824
hfenergy: -1836.1771187 hartree
pointgroup: C01 [X(C17H16Cl2N2O2)]
dipole: 0.0003227 -0.0009405 -0.789463 debye
polarizability: 350.2616754|37.8195492|177.2190307|-0.3554016|-0.0120969|196.270875 unknown
InChI: InChI=1S/C17H16Cl2N2O2/c1-10(22)20-16-5-3-12(8-14(16)18)7-13-4-6-17(15(19)9-13)21-11(2)23/h3-6,8-9,20-21H,7H2,1-2H3
charge 0 multiplicity 1
39 atoms
Cl -2.870555 2.131133 -1.831136
Cl 2.87546 -2.155183 -1.807208
O  -6.263749 -1.541895 0.077845
O  6.260343 1.547361 0.059046
N  -4.943383 0.124648 -0.92356
N  4.943841 -0.133062 -0.923839
C  0.000722 0.007367 2.143566
C  -1.28948 0.003562 1.326944
C  1.290605 0.005204 1.326749
C  -1.470147 0.917722 0.256663
C  1.473072 -0.920962 0.267075
C  -2.352191 -0.879145 1.634489
C  2.351142 0.894226 1.623241
C  -3.757187 0.049159 -0.153434
C  3.757628 -0.051389 -0.154434
C  -2.677362 0.926424 -0.451345
C  2.679867 -0.934811 -0.441513
C  -3.565914 -0.866244 0.917426
C  3.564544 0.875987 0.905733
C  -6.110108 -0.635559 -0.792778
C  6.108461 0.631846 -0.80222
C  -7.207994 -0.2837 -1.792791
C  7.204577 0.276324 -1.802872
H  0.012145 0.894032 2.808228
H  -0.010771 -0.874524 2.814502
H  -0.669696 1.61025 -0.021394
H  0.674331 -1.618849 -0.002391
H  -2.234593 -1.596827 2.455042
H  2.23214 1.621236 2.435338
H  -4.380736 -1.550579 1.160319
H  4.377845 1.565004 1.140391
H  -4.928291 0.83231 -1.664574
H  4.930341 -0.849096 -1.656794
H  -8.100817 0.056164 -1.239685
H  -7.494113 -1.195365 -2.344516
H  -6.920779 0.497135 -2.517782
H  8.11521 -0.009831 -1.249014
H  7.452316 1.173564 -2.395854
H  6.934776 -0.542339 -2.491966
