program: Gaussian 09
title: 000150337
version: EM64L-G09RevD.01
frameworkgroup: C1[X(C8H18O3S)]
method: RPBEPBE
basis: SDD
operation: Freq
keyword: #p
keyword: freq=noraman
keyword: PBEPBE/SDD
title: #p freq=noraman PBEPBE/SDD
converged: YES YES NO NO
title: Mulliken charges:
elementType: S O O O C C C C C C C C H H H H H H H H H H H H H H H H H H
charge: 1.022081 -0.417408 -0.533671 -0.522747 -0.316915 -0.601823 -0.342769 -0.352340 0.014526 -0.690391 -0.655497 -0.670720 0.238137 0.226675 0.286648 0.282980 0.197094 0.197008 0.202364 0.203622 0.241085 0.211678 0.211312 0.222356 0.205310 0.249558 0.221395 0.211300 0.233207 0.225945
chargesum: 0.00000
title: Mulliken charges with hydrogens summed into heavy atoms:
elementType: S O O O C C C C C C C C
charge: 1.022081 -0.417408 -0.533671 -0.522747 0.147897 -0.032195 0.051333 0.053646 0.255611 -0.045044 0.020766 -0.000268
polarizability: 1.75984310e+02 5.60047464e+00 1.12589323e+02 9.81203923e-01 1.50042765e+00 1.04473056e+02
1716.lowfreq: -32.6925 -10.1092 -0.0006 0.0013 0.0013 2.5466 15.6984 25.7795 39.2978
frequency: -22.5154 23.7032 38.9213 42.3531 69.9296 92.2851 113.9265 120.9606 169.1838 175.8097 178.8729 208.6725 223.4300 228.7125 252.0253 305.7506 311.2710 353.9468 374.8480 412.3918 439.9743 490.8648 569.6261 604.9367 730.8576 759.9412 776.0706 826.5780 839.8141 891.0452 893.1516 922.1530 927.8162 939.5318 967.0810 1006.2230 1051.8088 1069.9784 1085.6498 1101.4878 1112.6339 1150.2646 1174.2120 1193.1706 1226.9762 1251.7980 1279.7880 1289.1922 1294.2999 1318.9084 1335.7635 1339.0298 1347.5052 1378.3669 1390.9703 1397.0360 1413.5265 1454.0348 1463.1958 1465.7343 1467.8036 1470.1362 1478.0004 1481.0295 1483.3767 1488.0765 2963.2673 2974.9707 2975.3091 2986.0965 2988.5995 2991.3302 2995.5729 3005.5888 3031.7422 3052.4164 3060.3970 3072.4502 3076.5802 3083.5439 3090.2966 3095.1506 3103.8411 3143.3288
redmass: 1.7078 3.2982 3.3340 4.1815 4.2565 2.4782 1.9974 3.8133 4.3705 4.7381 1.0520 3.2669 1.3481 1.1059 3.3738 4.0995 4.1312 2.8753 6.0104 3.1972 3.0981 5.0361 5.9551 6.2072 1.0706 1.1257 4.0148 1.3223 9.0495 2.6203 1.8973 2.3942 1.2406 1.3447 1.6694 4.1518 2.8948 2.6385 1.3040 1.7687 2.2260 2.2263 1.9309 1.6177 1.2231 1.2790 1.2754 1.0521 1.1281 1.2293 1.3477 1.3744 1.5374 1.2307 1.2121 1.2160 1.1046 1.0482 1.0484 1.0670 1.0465 1.0725 1.0426 1.0683 1.0509 1.0913 1.0583 1.0492 1.0463 1.0370 1.0793 1.0397 1.0589 1.0995 1.1034 1.0561 1.1044 1.1013 1.0992 1.0992 1.0993 1.1005 1.1007 1.1102
irintensity: 0.0067 0.1370 2.9756 0.6587 1.4494 0.2467 0.4778 8.3721 1.8462 10.6256 0.0236 1.1918 0.4489 0.0085 0.8401 8.7125 7.2564 7.3835 13.6576 23.7227 15.6064 35.3876 104.0460 2.2634 11.1325 0.6975 74.5912 2.7634 59.4058 17.5247 2.3758 51.4342 3.7826 3.0257 24.4470 0.2974 13.8229 2.0545 15.2564 125.6292 1.6461 19.9889 10.4451 0.1770 1.5381 0.4967 11.6657 1.1678 0.6212 10.2418 23.1272 12.2927 0.0943 24.7645 11.2784 22.2866 5.9259 6.8385 2.0233 1.7571 12.2310 0.3760 13.1176 3.1671 13.8552 23.4805 5.6141 69.6213 17.7021 14.9808 7.0547 31.5075 18.2563 0.9255 16.5635 5.7083 9.2189 90.9153 46.2119 10.2326 34.9486 23.2622 32.5203 2.0607
temp: 298.150 k
press: 1.00000 atm
elementType: 16 8 8 8 6 6 6 6 6 6 6 6 1 1 1 1 1 1 1 1 1 1 1 1 1 1 1 1 1 1
symmnumber: 1
zpe: 660499.5 jmol-1
zpe.correction: 0.251571 hartree
zpe.thermalcorrener: 0.267597 hartree
zpe.thermalcorrenthalpy: 0.268541 hartree
zpe.thermalcorrgfe: 0.206464 hartree
zpe.sumelectzpe: -938.208719 hartree
zpe.sumelectthermal: -938.192692 hartree
zpe.sumelectthermalent: -938.191748 hartree
zpe.sumelectthermalfe: -938.253826 hartree
dipole: -1.6603 3.4525 -0.3055
dipole: 3.8431
quadrupole: -66.1617 -88.7825 -88.5150
quadrupole: 3.1322 -0.4419 0.6998
quadrupole: 14.9914 -7.6294 -7.3620 3.1322 -0.4419 0.6998
hfenergy: -938.4602895 hartree
pointgroup: C01 [X(C8H18O3S1)]
dipole: 0.6336622 1.3492313 0.2533795 debye
polarizability: 176.1520799|-4.6597294|112.6439262|-0.1592516|-0.6000301|104.2506826 unknown
InChI: InChI=1S/C8H18O3S/c1-4-5-6-7-12(9,10)11-8(2)3/h8H,4-7H2,1-3H3
charge 0 multiplicity 1
30 atoms
S  -0.817924 -0.671803 -0.234798
O  -2.0483 0.58187 0.414833
O  -1.120919 -0.914093 -1.812561
O  -0.697686 -1.956484 0.747102
C  2.00114 -0.321717 -0.147691
C  0.710106 0.478894 0.013675
C  3.2374 0.56954 0.138783
C  4.563367 -0.207166 -0.037446
C  -3.450117 0.341356 -0.059477
C  5.804009 0.661047 0.260946
C  -4.096964 -0.805689 0.730619
C  -4.137416 1.700567 0.140137
H  1.994969 -1.181474 0.549251
H  2.068443 -0.729595 -1.174552
H  0.550951 0.874623 1.029631
H  0.550763 1.26066 -0.74537
H  3.17951 0.966173 1.173075
H  3.234824 1.447609 -0.539197
H  4.62194 -0.597422 -1.073296
H  4.558663 -1.092034 0.630278
H  -3.402647 0.093587 -1.139833
H  5.784989 1.039146 1.300394
H  5.850809 1.535911 -0.414577
H  6.737146 0.083838 0.129468
H  -5.135796 -0.965424 0.387133
H  -3.539435 -1.748818 0.594201
H  -4.114156 -0.569095 1.80912
H  -5.189469 1.633795 -0.193015
H  -3.631112 2.487347 -0.444023
H  -4.125789 1.98765 1.20609
