program: Gaussian 09
title: 000150333
version: EM64L-G09RevD.01
frameworkgroup: C1[X(C5H12O3S)]
method: RPBEPBE
basis: SDD
operation: Freq
keyword: #p
keyword: freq=noraman
keyword: PBEPBE/SDD
title: #p freq=noraman PBEPBE/SDD
converged: YES YES NO NO
title: Mulliken charges:
elementType: S O O O C C C C C H H H H H H H H H H H H
charge: 1.033693 -0.412178 -0.521825 -0.532032 -0.547794 -0.323619 -0.664549 -0.223478 -0.656193 0.278328 0.281040 0.234023 0.244455 0.235089 0.217786 0.217605 0.223046 0.236315 0.216191 0.230636 0.233460
chargesum: 0.00000
title: Mulliken charges with hydrogens summed into heavy atoms:
elementType: S O O O C C C C C
charge: 1.033693 -0.412178 -0.521825 -0.532032 0.011575 0.154859 0.005931 0.235883 0.024094
polarizability: 1.25093002e+02 -2.42455060e+00 8.33084949e+01 1.49320491e+00 -6.53329949e-01 7.89749618e+01
1716.lowfreq: -18.1707 -9.8541 -6.5578 0.0020 0.0022 0.0032 28.3031 32.7646 52.8081
frequency: 27.6228 32.4042 52.1258 61.1626 77.8738 161.5537 210.2143 229.7148 240.5192 241.5850 248.9607 269.2393 301.8237 372.7742 476.0607 561.7744 608.0696 756.7017 819.0891 833.4353 842.9442 852.6150 903.4034 943.3888 1012.5903 1037.7045 1077.9522 1096.0006 1112.3679 1138.8151 1211.0454 1243.8323 1248.2860 1291.6064 1334.9653 1349.7101 1389.4132 1391.6625 1415.6371 1456.7949 1476.6716 1477.3003 1478.8898 1488.0771 1491.9616 2984.6606 2985.1150 2993.9497 3006.4394 3050.0689 3054.7196 3058.2138 3086.7826 3089.0888 3090.6683 3108.9683 3146.7298
redmass: 3.2587 2.8123 1.8847 2.3479 3.8294 4.9242 3.3662 1.1115 4.1948 1.3192 3.8851 4.1478 5.1741 7.2746 7.3187 7.6973 5.5112 1.0926 1.1257 3.6386 3.9277 1.5388 1.8305 4.2130 2.8083 3.1480 1.3956 2.1515 2.1935 1.4186 1.4048 1.2129 1.1492 1.1033 1.3634 1.2634 1.2187 1.1862 1.1100 1.0405 1.0407 1.0413 1.0458 1.0938 1.0819 1.0372 1.0520 1.0371 1.0600 1.1088 1.0564 1.1020 1.1023 1.0994 1.0980 1.1022 1.1103
irintensity: 0.5884 0.9831 1.5701 2.0115 2.9898 19.2336 1.0371 0.0763 1.8204 0.6764 5.7827 1.7053 9.3321 22.7393 40.8652 112.4242 1.3565 6.7873 7.2824 60.8838 47.8626 16.6598 11.7050 67.5208 63.5144 8.2828 21.9082 56.2008 2.8544 4.7938 0.4567 4.5644 1.4559 0.3963 5.1060 8.4059 15.4774 9.1814 8.0429 13.0983 6.9113 15.0766 7.6508 14.2621 18.7545 49.5868 14.5248 28.9925 8.3158 13.7356 3.7903 0.2218 38.9058 29.6676 26.0385 34.9456 2.5179
temp: 298.150 k
press: 1.00000 atm
elementType: 16 8 8 8 6 6 6 6 6 1 1 1 1 1 1 1 1 1 1 1 1
symmnumber: 1
zpe: 442628.7 jmol-1
zpe.correction: 0.168588 hartree
zpe.thermalcorrener: 0.181319 hartree
zpe.thermalcorrenthalpy: 0.182264 hartree
zpe.thermalcorrgfe: 0.127392 hartree
zpe.sumelectzpe: -820.531327 hartree
zpe.sumelectthermal: -820.518596 hartree
zpe.sumelectthermalent: -820.517652 hartree
zpe.sumelectthermalfe: -820.572523 hartree
dipole: -0.9776 -3.7485 0.2513
dipole: 3.8821
quadrupole: -46.5053 -69.2190 -69.2616
quadrupole: 1.9077 -0.4478 -0.2563
quadrupole: 15.1567 -7.5570 -7.5996 1.9077 -0.4478 -0.2563
hfenergy: -820.6999153 hartree
pointgroup: C01 [X(C5H12O3S1)]
dipole: -0.3845337 1.4574117 -0.2465382 debye
dipolederiv: 1.6168657 0.1041937 -0.0172495 0.3263809 1.3115452 -0.0242727 0.0049211 0.0090898 1.2713435 -1.2460209 -0.0988415 -0.0127165 -0.1133697 -0.5184599 -0.0046457 0.0048107 -0.0322379 -0.4336109 -0.6379629 0.004636 0.0277451 -0.0137088 -0.5752034 0.0751296 0.096751 0.138543 -0.6266685 -0.6073723 0.0343192 0.0080246 0.0235249 -0.5701503 -0.047922 -0.0422068 -0.1330092 -0.6229169 0.2675721 -0.1280483 0.0261155 -0.1673713 -0.0126471 0.0037379 0.0103604 0.0093448 -0.0152999 -0.0495872 0.0248161 0.005111 0.3338154 -0.0591572 0.0300865 -0.0307418 0.0372622 0.0942627 -0.1086383 0.0688747 -0.0075098 -0.1657613 0.1039047 -0.0005787 0.0278476 -0.0069062 0.1145264 0.8393076 0.0462586 0.0186894 -0.4900952 0.1082799 -0.0357226 -0.0784005 -0.0323638 0.3025313 -0.209904 -0.1230628 0.0105927 0.1302743 0.0515313 0.0131796 0.0327496 0.0266237 0.0744414 -0.0052105 0.0299003 0.0080852 0.0264661 0.030038 0.0494225 0.0566146 0.0436314 -0.0061529 0.0061074 0.0249336 -0.0141542 0.0006148 0.0066109 -0.0495665 -0.0603013 -0.0466363 0.0281915 0.0618856 0.0171772 0.0105818 -0.034783 -0.013077 -0.0914786 -0.0198759 -0.1097521 -0.0076367 0.0791363 0.0191795 -0.0222147 -0.0295648 0.0465856 0.0725298 0.0240613 0.0813618 -0.0417786 -0.1847595 -0.039143 0.0105006 -0.0477593 0.0377576 0.0122378 0.014205 0.0112347 0.1100416 0.0977717 -0.0303873 -0.0477892 0.0248763 -0.0393418 -0.1079426 -0.0107503 -0.1300793 -0.039131 0.1005609 -0.0128385 0.0469653 0.0326418 0.0216642 0.0885251 -0.0073503 0.115016 -0.102182 -0.0791472 -0.0045033 -0.008257 0.0995847 -0.0158805 0.0967827 -0.0553938 0.1210299 -0.0540029 -0.0050628 -0.0415168 -0.0331058 0.0804973 0.0231897 -0.0769244 0.0418558 -0.0890413 -0.0494275 -0.1825578 0.0320398 0.0318967 0.0110486 0.0439183 -0.0128535 0.0445007 -0.0071727 0.1141934 0.1156693 0.0527605 -0.0661422 0.0023643 0.0018203 0.098282 -0.0391141 0.1124329 -0.0428082 0.1313468 0.0192524 0.0248309 -0.0296759 0.0170718 -0.0880059 -0.014543 -0.1183716 -0.0679157 unknown
polarizability: 125.093055|2.2588898|83.133737|-1.733306|-1.0734787|79.1496667 unknown
InChI: InChI=1S/C5H12O3S/c1-3-5-9(6,7)8-4-2/h3-5H2,1-2H3
charge 0 multiplicity 1
21 atoms
S  0.02623 -0.698456 0.116943
O  1.406202 0.55835 0.279808
O  -0.180235 -1.513671 1.501513
O  0.237242 -1.525777 -1.264261
C  -1.350706 0.637477 -0.075199
C  -2.729673 -0.012613 0.047957
C  -3.836798 1.062735 -0.071358
C  2.756962 -0.021649 0.051963
C  3.700518 1.179637 -0.053281
H  -1.133013 1.072188 -1.063303
H  -1.11627 1.349023 0.732557
H  -2.860076 -0.77447 -0.743134
H  -2.809927 -0.530774 1.021181
H  -4.831301 0.591133 0.015914
H  -3.750387 1.82139 0.727879
H  -3.793138 1.583232 -1.045403
H  3.02632 -0.674804 0.903435
H  2.749282 -0.615652 -0.882291
H  4.735234 0.821976 -0.20962
H  3.420655 1.825479 -0.902637
H  3.675579 1.781246 0.871036
