program: Gaussian 09
title: 000150332
version: EM64L-G09RevD.01
frameworkgroup: C1[X(C8H12N4O3)]
method: RPBEPBE
basis: SDD
operation: Freq
keyword: #p
keyword: freq=noraman
keyword: PBEPBE/SDD
title: #p freq=noraman PBEPBE/SDD
converged: YES YES NO NO
title: Mulliken charges:
elementType: O O O N N N N C C C C C C C C H H H H H H H H H H H H
charge: -0.268957 -0.236398 -0.321916 -0.241397 -0.080255 -0.430397 -0.612744 0.226279 0.421698 -0.432230 -0.396327 -0.708231 0.220609 -0.786488 0.323075 0.241980 0.258875 0.298952 0.328267 0.224195 0.238183 0.316279 0.260387 0.260978 0.211376 0.343676 0.340533
chargesum: 0.00000
title: Mulliken charges with hydrogens summed into heavy atoms:
elementType: O O O N N N N C C C C C C C C
charge: -0.268957 -0.236398 -0.321916 -0.241397 -0.080255 -0.114119 0.071464 0.226279 0.421698 0.068625 -0.097375 0.082414 0.220609 -0.053747 0.323075
polarizability: 1.87038351e+02 4.17864306e+00 1.23340028e+02 -3.12517070e+00 6.14250345e+00 8.47086978e+01
1716.lowfreq: -7.6455 -6.5052 -1.9281 -0.0007 -0.0006 0.0001 24.9452 39.4723 55.4977
frequency: 24.8502 39.4533 55.4886 72.0922 87.5199 94.7649 138.1285 146.1439 178.7219 209.0697 229.1248 261.8637 305.1861 326.0356 347.9996 373.4435 459.7849 488.3623 502.1027 532.4115 552.2130 556.8142 590.2226 605.6125 642.5422 667.9778 682.5571 703.1432 765.8911 781.2705 794.0147 838.7788 917.9138 933.2045 961.8751 972.8176 997.0640 1038.8873 1059.2276 1121.3191 1128.3638 1171.0390 1192.0738 1228.8421 1251.7147 1263.4746 1306.6231 1346.6395 1367.0481 1381.7557 1391.1554 1438.6913 1448.7243 1460.8982 1468.1550 1470.3480 1488.2691 1506.4511 1522.0977 1556.9160 1585.2877 1626.2793 1665.9680 2963.3591 2994.1724 3043.9433 3050.2505 3078.4060 3094.7051 3098.1075 3135.8729 3280.0214 3536.1452 3555.9730 3714.1190
redmass: 5.5807 5.2137 4.8738 1.4213 2.4034 3.9782 5.1425 4.7295 1.8429 4.5226 2.0160 4.2802 4.2440 2.2709 3.6270 4.6942 3.3316 3.6260 1.1396 1.1049 2.5467 1.4313 3.3792 5.2338 5.3370 4.5673 6.0728 11.4896 5.4248 5.0331 5.9759 1.3210 4.5515 3.6279 3.6756 2.5533 1.5667 1.6194 1.9721 1.6237 1.5308 2.3020 2.7871 2.4724 1.4282 2.3308 2.0807 3.8129 1.8178 2.7757 1.2245 1.2086 1.0449 1.2184 3.5023 1.1251 1.2473 1.2496 1.8366 5.9340 1.2633 6.1938 5.6044 1.0344 1.0364 1.0622 1.1017 1.1017 1.0999 1.0984 1.1032 1.0993 1.0767 1.0446 1.1059
irintensity: 8.1487 2.5358 7.1387 1.4837 8.4402 3.8441 1.2481 2.7288 0.1176 2.8099 7.5944 5.1875 9.3718 8.6570 3.0635 9.2379 3.5331 21.5292 217.7249 101.0240 29.2969 58.2398 0.3157 1.5919 5.7838 0.9419 2.0301 29.5529 71.3459 9.7363 0.5868 42.0263 2.4677 87.9890 144.0754 112.1885 6.9790 14.0555 7.1774 2.2526 7.9785 19.3012 9.0950 78.6114 2.3367 4.7696 361.5684 176.0629 110.4389 32.3490 34.7034 49.1758 14.5721 56.5561 2.3363 17.9924 47.2314 88.9968 190.5592 119.7800 89.0668 168.8787 388.7881 65.2879 14.3423 15.6181 29.6282 32.1587 18.5414 9.1198 1.4981 3.1857 15.1801 77.4713 51.1369
temp: 298.150 k
press: 1.00000 atm
elementType: 8 8 8 7 7 7 7 6 6 6 6 6 6 6 6 1 1 1 1 1 1 1 1 1 1 1 1
symmnumber: 1
zpe: 549491.4 jmol-1
zpe.correction: 0.209290 hartree
zpe.thermalcorrener: 0.224857 hartree
zpe.thermalcorrenthalpy: 0.225801 hartree
zpe.thermalcorrgfe: 0.164735 hartree
zpe.sumelectzpe: -755.617948 hartree
zpe.sumelectthermal: -755.602381 hartree
zpe.sumelectthermalent: -755.601437 hartree
zpe.sumelectthermalfe: -755.662503 hartree
dipole: 1.7729 -5.9792 -0.0084
dipole: 6.2365
quadrupole: -77.3961 -93.0113 -82.7985
quadrupole: 15.2273 13.4040 -3.7654
quadrupole: 7.0059 -8.6094 1.6035 15.2273 13.4040 -3.7654
hfenergy: -755.8272385 hartree
pointgroup: C01 [X(C8H12N4O3)]
dipole: -0.6587265 2.3413354 0.3234396 debye
polarizability: 187.2471796|2.9310474|124.187877|0.2960628|-1.1031913|83.6520202 unknown
InChI: InChI=1S/C8H12N4O3/c1-5(13)11-6-3-10-7(12(6)2)4-15-8(9)14/h3,11H,4,9H2,1-2H3
charge 0 multiplicity 1
27 atoms
O  -3.035309 -0.638155 0.284223
O  4.126413 -0.913243 0.450085
O  -3.276633 1.684476 -0.081316
N  0.14887 0.327742 -0.495883
N  -0.013647 -1.936689 -0.386749
N  2.514376 0.704635 -0.036696
N  -4.341224 0.57389 1.687399
C  -0.701639 -0.792343 -0.605168
C  1.425532 -0.172028 -0.197446
C  -2.151804 -0.755731 -0.935246
C  1.307596 -1.569738 -0.129681
C  -0.179036 1.746816 -0.695939
C  3.818192 0.299953 0.279751
C  4.830174 1.435577 0.397789
C  -3.5315 0.637173 0.577777
H  -2.423113 0.059039 -1.627897
H  -2.429797 -1.734538 -1.350531
H  2.09066 -2.288634 0.08109
H  -1.2737 1.873301 -0.723373
H  0.190726 2.353911 0.152266
H  0.258721 2.127699 -1.638096
H  2.34623 1.704465 -0.163987
H  5.636753 1.276716 -0.338862
H  5.292702 1.400812 1.39912
H  4.399333 2.440049 0.240435
H  -4.493366 -0.313619 2.160873
H  -4.781508 1.426264 2.021663
