program: Gaussian 09
title: 000013471
version: EM64L-G09RevD.01
frameworkgroup: C1[X(C20H28O)]
method: RPBEPBE
basis: SDD
operation: Freq
keyword: #pfreq=noraman
keyword: PBEPBE/SDD
title: #p freq=noraman PBEPBE/SDD
converged: YES YES NO NO
title: Mulliken charges:
elementType: O C C C C C C C C C C C C C C C C C C C C H H H H H H H H H H H H H H H H H H H H H H H H H H H H
charge: -0.448862 0.352402 -0.176389 -0.104688 -0.162053 0.039325 -0.527093 -0.554171 -0.508569 -0.497000 -0.514096 0.183485 -0.819735 -0.543487 0.196882 -0.534044 -0.511284 0.224305 -0.423777 -0.408224 -0.549072 0.245006 0.239909 0.198888 0.216202 0.221093 0.217970 0.227748 0.215551 0.211024 0.240475 0.219116 0.217368 0.211720 0.223944 0.258526 0.218995 0.210497 0.209010 0.231835 0.207738 0.205454 0.206737 0.343201 0.198016 0.203540 0.198759 0.201497 0.286324
chargesum: 0.00000
title: Mulliken charges with hydrogens summed into heavy atoms:
elementType: O C C C C C C C C C C C C C C C C C C C C
charge: -0.105661 0.352402 0.068617 0.135221 0.036835 0.039325 -0.089798 -0.108453 -0.081994 -0.037409 -0.085008 0.183485 -0.118270 -0.123980 0.196882 -0.094471 -0.099092 0.224305 -0.022221 -0.007967 -0.262747
polarizability: 2.42905292e+02 -6.73577419e+00 1.94328366e+02 9.81736962e+00 -5.97418805e+00 1.77399534e+02
1716.lowfreq: -8.0730 -1.4899 -0.0008 -0.0006 0.0007 4.4535 35.4812 53.2092 86.0935
frequency: 35.4579 53.2087 86.0824 94.5203 111.7586 122.9165 138.0800 163.0367 183.9824 201.8431 221.3425 237.5570 241.3732 264.5664 273.9326 288.3595 295.8028 313.8852 356.9384 360.1869 377.3089 395.9138 413.2743 419.9483 436.0090 458.8366 478.3063 485.9810 503.1260 538.9153 545.5967 576.2727 592.9070 615.9015 622.9248 649.0136 656.8167 698.7086 726.2901 778.4453 812.4125 820.2019 833.9025 847.4711 850.9129 868.9926 882.0822 897.2170 922.2699 936.0674 959.2357 963.3291 971.2139 975.5337 993.5391 1007.7213 1015.1466 1034.0793 1041.9656 1054.1679 1072.3934 1081.9333 1086.1863 1104.0343 1110.3448 1115.9748 1129.3768 1135.6799 1146.7331 1151.6392 1169.0337 1174.4695 1177.6512 1190.8013 1200.1560 1218.1157 1224.7048 1230.5183 1242.9973 1245.2263 1252.9517 1255.6318 1269.6685 1287.4083 1293.8156 1296.3091 1317.3656 1318.8876 1327.9056 1331.0528 1333.0064 1336.2697 1338.8778 1342.3385 1351.2715 1356.3813 1363.1397 1378.1340 1394.8838 1452.9650 1456.1504 1459.8136 1463.0358 1465.9708 1467.4937 1470.3422 1473.2326 1474.8123 1478.2387 1489.3978 1491.9382 1677.3729 2117.5596 2884.5590 2930.1067 2930.4068 2933.2240 2937.7009 2956.6055 2966.6537 2971.1454 2972.3404 2974.3541 2978.0399 2985.7098 2993.4283 2994.7835 3002.8581 3011.7245 3017.6017 3028.7660 3030.9881 3032.1174 3041.2109 3042.1911 3054.9414 3083.1088 3091.9935 3103.9883 3425.8057 3557.4425
redmass: 3.6801 3.6110 2.8746 3.1335 2.2990 3.0913 3.4596 1.4926 2.7202 1.8821 2.3233 3.1663 3.5606 1.1999 2.2012 1.7599 2.7121 2.9165 2.4623 2.5263 3.3202 3.5874 3.7902 3.2959 3.4190 3.5072 4.0464 2.8330 3.5427 2.6876 2.5610 3.1092 4.6141 2.5549 1.5415 2.5780 1.2568 2.7882 3.1622 1.6931 1.6446 1.8848 1.8197 1.9458 1.9758 2.4176 2.3740 1.5416 2.1476 1.7016 2.5444 2.4255 1.7901 3.3480 2.1871 2.0901 2.2262 2.9800 2.2479 2.0982 1.7705 2.2668 1.9019 1.6229 2.0867 2.1141 2.2268 2.0531 1.7178 1.4862 1.5643 1.6575 2.2896 1.5280 1.8751 1.4198 1.5059 1.4425 1.3687 1.3213 1.5505 1.3982 1.1838 1.3812 1.3483 1.3896 1.4735 1.4340 1.5886 1.4437 1.4484 1.3829 1.4865 1.4878 1.5018 1.6393 1.7301 1.5289 1.1930 1.0806 1.1008 1.0690 1.0815 1.0789 1.0842 1.0928 1.0786 1.0949 1.0786 1.0758 1.0647 7.1649 6.0723 1.0790 1.0776 1.0654 1.0685 1.0643 1.0743 1.0761 1.0619 1.0687 1.0598 1.0637 1.0870 1.0877 1.0621 1.0369 1.0889 1.0614 1.1008 1.0987 1.0968 1.1040 1.1021 1.1017 1.1042 1.0982 1.0990 1.1576 1.0661
irintensity: 0.1224 0.1498 0.0735 0.0190 0.0855 0.5005 0.2568 0.5692 1.0060 0.4408 2.5880 0.4625 1.3105 101.0493 21.5081 0.6095 9.1805 3.0648 0.2085 4.3677 2.4674 1.8489 5.9369 2.4546 0.5190 2.0963 6.0740 1.8787 1.3704 1.6884 1.6030 0.6180 0.3522 25.5318 47.7782 2.2196 61.6519 2.5879 0.6055 2.2078 5.1945 3.2316 0.4871 4.6878 8.5340 11.7238 0.3625 0.6264 2.9172 3.9934 37.5497 76.2944 10.3379 8.5465 2.4164 4.6034 3.1784 8.5294 6.8801 6.6522 0.0294 3.0158 1.6129 2.6236 2.0642 2.7359 1.9459 7.9689 0.2447 3.3137 0.4410 3.4841 1.7866 6.9381 1.2261 10.1891 7.6496 21.0617 2.2319 3.1800 3.0868 4.2812 3.9875 3.5074 1.2822 6.3780 3.6713 10.0584 3.0414 9.3442 1.7416 4.2364 0.2255 0.3888 0.4416 0.4705 1.2198 2.9055 29.6291 1.2749 1.6716 4.6956 10.4512 6.7402 10.5796 8.0537 7.3485 9.5356 3.9070 8.1885 6.3494 0.3946 3.7740 16.8483 10.4145 4.5072 43.2017 91.1153 12.0522 27.2067 40.6579 30.5390 24.7854 25.2209 22.4649 93.9503 42.9176 24.7379 27.2193 34.5164 60.9078 66.5261 43.8353 73.0751 50.5921 14.1229 47.9564 22.3646 19.3710 68.8271 6.9203
temp: 298.150 k
press: 1.00000 atm
elementType: 8 6 6 6 6 6 6 6 6 6 6 6 6 6 6 6 6 6 6 6 6 1 1 1 1 1 1 1 1 1 1 1 1 1 1 1 1 1 1 1 1 1 1 1 1 1 1 1 1
symmnumber: 1
zpe: 1127050.8 jmol-1
zpe.correction: 0.429271 hartree
zpe.thermalcorrener: 0.449263 hartree
zpe.thermalcorrenthalpy: 0.450208 hartree
zpe.thermalcorrgfe: 0.382785 hartree
zpe.sumelectzpe: -852.469434 hartree
zpe.sumelectthermal: -852.449442 hartree
zpe.sumelectthermalent: -852.448498 hartree
zpe.sumelectthermalfe: -852.515920 hartree
dipole: 0.1277 0.8806 0.9922
dipole: 1.3327
quadrupole: -121.3565 -127.3635 -125.6329
quadrupole: 2.7512 5.3934 -2.9078
quadrupole: 3.4278 -2.5792 -0.8486 2.7512 5.3934 -2.9078
hfenergy: -852.8987052 hartree
pointgroup: C01 [X(C20H28O1)]
dipole: 0.0532119 0.3342929 0.4004325 debye
polarizability: 243.2833328|-6.7153292|194.5758327|8.691927|-5.2484459|176.7740258 unknown
InChI: InChI=1S/C20H28O/c1-3-20(21)13-11-18-17-9-8-14-6-4-5-7-15(14)16(17)10-12-19(18,20)2/h1,16-18,21H,4-13H2,2H3
charge 0 multiplicity 1
49 atoms
O  4.361936 -0.870074 -1.091274
C  1.968081 -0.37136 -0.59904
C  1.280786 0.817509 0.14151
C  -0.227883 0.894033 -0.149989
C  -0.90123 -0.433446 0.320559
C  3.464655 -0.129045 -0.170948
C  1.320552 -1.693267 -0.129505
C  2.18484 2.040274 -0.174125
C  -0.219986 -1.674239 -0.332738
C  3.622903 1.435487 -0.314534
C  -0.92277 2.087443 0.534965
C  -2.432841 -0.382256 0.145264
C  1.886109 -0.261772 -2.14579
C  -2.403205 2.163074 0.109887
C  -3.105485 0.80884 0.082143
C  -3.177116 -1.718847 0.125776
C  -4.626697 0.892228 -0.032088
C  3.754616 -0.552405 1.217469
C  -4.657195 -1.612051 -0.305176
C  -5.343177 -0.411954 0.375176
C  4.076389 -0.884097 2.361414
H  1.382835 0.610146 1.230884
H  -0.384761 0.997879 -1.245458
H  -0.696611 -0.5159 1.416365
H  1.537176 -1.842126 0.947434
H  1.760797 -2.553233 -0.670279
H  2.133982 2.80127 0.623854
H  1.867549 2.529829 -1.114518
H  -0.468086 -1.705929 -1.412778
H  -0.632724 -2.601414 0.107601
H  4.047696 1.634187 -1.31485
H  4.319943 1.842738 0.438143
H  -0.409456 3.03599 0.284281
H  -0.853149 1.961967 1.635422
H  2.256267 0.706709 -2.524176
H  2.502751 -1.052606 -2.603507
H  0.848112 -0.382949 -2.496502
H  -2.480008 2.628011 -0.898189
H  -2.956893 2.843954 0.789345
H  -2.662493 -2.424494 -0.553718
H  -3.112284 -2.182102 1.135655
H  -4.989647 1.733397 0.593961
H  -4.903922 1.158445 -1.0761
H  5.275854 -0.8635 -0.70747
H  -4.709324 -1.477257 -1.404736
H  -5.186054 -2.556127 -0.07099
H  -5.290853 -0.535219 1.475695
H  -6.414985 -0.363796 0.102228
H  4.338504 -1.182643 3.359648
