program: Gaussian 09
title: 000150328
version: EM64L-G09RevD.01
frameworkgroup: C1[X(C16H11NO4)]
method: RPBEPBE
basis: SDD
operation: Freq
keyword: #p
keyword: freq=noraman
keyword: PBEPBE/SDD
title: #p freq=noraman PBEPBE/SDD
converged: YES YES NO NO
title: Mulliken charges:
elementType: O O O O N C C C C C C C C C C C C C C C C H H H H H H H H H H H
charge: -0.459012 -0.424209 -0.210290 -0.218185 0.020936 -0.346375 -0.327255 0.055182 0.010244 0.309285 0.431711 0.294503 0.474927 -0.383256 -0.429771 0.208267 -0.424601 -0.487072 -0.452739 -0.427115 -0.245160 0.244907 0.203463 0.288149 0.244320 0.308063 0.243231 0.249530 0.289618 0.233845 0.361973 0.362887
chargesum: 0.00000
title: Mulliken charges with hydrogens summed into heavy atoms:
elementType: O O O O N C C C C C C C C C C C C C C C C
charge: -0.097039 -0.061322 -0.210290 -0.218185 0.020936 -0.101468 -0.123792 0.055182 0.010244 0.309285 0.431711 0.294503 0.474927 -0.095107 -0.185452 0.208267 -0.116538 -0.243841 -0.203209 -0.137498 -0.011315
polarizability: 3.06493498e+02 2.30333773e+01 2.39521893e+02 7.40076762e+00 -3.77424948e+00 8.68460643e+01
1716.lowfreq: -26.3846 -6.3178 -0.0004 -0.0002 -0.0002 4.5787 5.9848 54.3011 75.5186
frequency: -26.3795 54.2946 75.5062 91.9195 138.0264 192.0676 197.4904 226.3385 245.0893 262.3810 280.5940 305.4162 322.4571 334.0419 344.1523 400.9698 404.3443 444.6546 458.5781 483.5589 496.8791 523.6610 561.8185 569.9754 570.9407 586.5454 597.9341 639.2023 655.5355 692.2239 705.9029 727.8422 739.0678 769.0399 792.3550 801.6285 830.5248 848.4272 867.2387 873.9769 888.6219 925.0356 960.5505 981.5587 986.8456 998.7355 1011.1776 1024.1607 1059.6006 1076.0215 1087.4191 1145.1416 1159.0398 1171.0637 1177.9298 1189.6476 1194.5339 1202.4800 1232.8926 1244.7747 1251.1428 1275.3517 1304.7720 1311.5216 1342.9460 1357.7149 1380.7801 1385.2358 1406.8657 1416.1906 1427.3751 1442.6304 1447.3467 1494.9555 1537.8194 1588.5146 1593.2164 1609.4354 1625.2791 2931.3713 2947.7703 3128.6971 3133.8486 3136.9983 3162.9476 3175.5159 3192.8878 3218.9226 3467.8001 3572.9902
redmass: 14.8983 7.1994 4.9223 6.5409 5.6018 5.9404 5.5340 4.9751 4.9628 5.4612 1.3751 4.0039 6.2152 6.1548 5.2423 7.0382 6.3638 4.4239 5.2638 3.1989 1.2127 5.8091 6.0862 6.1026 3.6979 5.8238 5.2753 4.3520 5.5678 7.1670 5.6084 4.7535 6.9543 2.2813 2.3168 2.9182 4.7674 7.2648 1.6722 1.4966 4.6468 1.4857 3.6022 4.2375 1.4280 1.4027 1.3569 6.2794 3.7930 3.0728 2.0571 1.8129 1.3472 1.4934 1.2436 2.6079 2.2034 1.2006 1.5657 1.6811 1.8145 1.4185 2.8083 1.2131 4.4931 2.2674 1.9889 5.4345 2.9987 3.4260 2.8674 3.3742 4.4316 3.4244 5.9029 7.0436 7.5635 7.0783 7.0587 1.0824 1.0845 1.0868 1.0914 1.0919 1.0992 1.0887 1.0958 1.0930 1.0647 1.0664
irintensity: 0.0146 1.2402 0.3290 2.9381 8.5908 0.4934 2.5195 7.6581 0.0358 24.3868 60.4542 5.1974 2.5006 4.7668 2.5964 1.2821 8.3357 4.8550 1.7693 14.7433 153.6041 7.9980 0.4309 0.7421 2.8407 3.5527 0.2049 1.8900 28.8114 14.0576 3.0478 8.4611 29.2280 45.8998 11.3059 2.2715 7.4797 10.0305 67.2781 42.6599 35.3387 1.2116 36.4543 39.8499 5.6635 0.6193 0.1805 6.8311 35.8598 8.5660 1.7738 12.9495 130.0371 67.6079 27.3374 232.6927 155.1158 28.0838 13.4394 15.2260 25.1478 5.8279 16.6860 14.3515 37.6331 23.1833 3.3586 41.7313 16.7374 32.6911 0.9972 0.7986 3.8300 25.2769 5.7077 5.7431 33.3527 23.2605 4.3400 43.9643 60.4880 0.5993 4.9983 20.1985 32.2637 2.0705 1.4442 14.5071 19.0305 14.4177
temp: 298.150 k
press: 1.00000 atm
elementType: 8 8 8 8 7 6 6 6 6 6 6 6 6 6 6 6 6 6 6 6 6 1 1 1 1 1 1 1 1 1 1 1
symmnumber: 1
zpe: 616667.0 jmol-1
zpe.correction: 0.234876 hartree
zpe.thermalcorrener: 0.249935 hartree
zpe.thermalcorrenthalpy: 0.250879 hartree
zpe.thermalcorrgfe: 0.193370 hartree
zpe.sumelectzpe: -970.437922 hartree
zpe.sumelectthermal: -970.422863 hartree
zpe.sumelectthermalent: -970.421919 hartree
zpe.sumelectthermalfe: -970.479428 hartree
dipole: -6.6424 1.9104 -3.1491
dipole: 7.5952
quadrupole: -135.5847 -99.1377 -124.2074
quadrupole: 1.3610 5.9175 -5.6301
quadrupole: -15.9414 20.5055 -4.5641 1.3610 5.9175 -5.6301
hfenergy: -970.672798 hartree
pointgroup: C01 [X(C16H11N1O4)]
dipole: -2.5877265 -0.8134 1.2535141 debye
polarizability: 307.3498022|-21.5477041|238.5826073|-8.9347984|-3.150966|86.9290458 unknown
InChI: InChI=1S/C16H11NO4/c18-15-10-3-1-2-8-4-5-9-12(17(20)21)7-6-11(16(15)19)14(9)13(8)10/h1-7,15-16,18-19H
charge 0 multiplicity 1
32 atoms
O  -1.183325 -3.638094 0.242924
O  -2.425981 -1.884858 -1.525997
O  4.876866 -0.478514 -0.221255
O  4.050721 1.630955 -0.250763
N  3.883092 0.350063 -0.175873
C  -1.279413 -2.214734 0.628954
C  -2.481537 -1.567599 -0.088659
C  0.058816 -0.114127 0.134782
C  -1.200717 0.621569 0.119574
C  0.037178 -1.536281 0.2894
C  -2.458856 -0.059577 0.063789
C  1.316673 0.593586 0.018175
C  -1.186553 2.056532 0.10847
C  1.225802 -2.276885 0.224756
C  -3.655382 0.671073 0.068649
C  2.512623 -0.214632 -0.034616
C  1.282718 2.042268 -0.014759
C  0.084449 2.731866 0.056737
C  -2.419946 2.777434 0.116909
C  2.459998 -1.618036 0.044987
C  -3.641291 2.094074 0.110695
H  -1.44144 -2.126776 1.727222
H  -3.420554 -1.982736 0.341995
H  1.181986 -3.364338 0.316305
H  -4.610373 0.136078 0.014319
H  2.224361 2.582836 -0.087487
H  0.092446 3.828173 0.050126
H  -2.394818 3.873164 0.116944
H  3.395562 -2.178603 -0.014599
H  -4.58565 2.648016 0.116838
H  -1.853049 -4.162888 0.749562
H  -2.054904 -2.808211 -1.593305
