program: Gaussian 09
title: 000013460
version: EM64L-G09RevD.01
frameworkgroup: C1[X(C13H18N2O3)]
method: RPBEPBE
basis: SDD
operation: Freq
keyword: #p
keyword: freq=noraman
keyword: PBEPBE/SDD
title: #p freq=noraman PBEPBE/SDD
converged: YES YES NO NO
title: Mulliken charges:
elementType: O O O N N C C C C C C C C C C C C C H H H H H H H H H H H H H H H H H H
charge: -0.223509 -0.237246 -0.214175 -0.257506 -0.376947 0.028646 -0.431271 -0.430098 -0.398183 -0.399016 -0.393261 0.227312 -0.329748 0.211172 0.154774 -0.498627 -0.030838 -0.570148 0.242937 0.248355 0.201635 0.201469 0.242249 0.203875 0.197525 0.198186 0.203567 0.201551 0.199517 0.289421 0.250456 0.248405 0.364349 0.227298 0.220810 0.227064
chargesum: 0.00000
title: Mulliken charges with hydrogens summed into heavy atoms:
elementType: O O O N N C C C C C C C C C C C C C
charge: -0.223509 -0.237246 -0.214175 -0.257506 -0.012598 0.271583 0.018719 0.013621 0.003217 0.002737 0.007806 0.227312 -0.040327 0.211172 0.154774 0.000234 0.196460 -0.122274
polarizability: 1.95496216e+02 7.16510293e-01 1.35866597e+02 6.33669564e-01 7.85340983e+00 1.38836064e+02
1716.lowfreq: -7.1262 -3.6411 0.0004 0.0005 0.0008 13.7436 23.5394 38.4748 60.3816
frequency: 21.1578 38.1146 60.2178 67.3593 76.1870 79.2382 153.8690 162.9159 170.4481 204.4163 221.6135 225.8790 252.0273 331.1593 337.7076 367.1073 393.9374 409.0020 426.0035 443.1965 449.9534 469.4387 482.9463 528.3926 591.9585 625.5568 628.6006 670.6308 708.7233 731.4684 775.2210 793.2567 798.4878 813.4170 835.1125 853.0956 887.6682 893.6665 904.9499 923.9363 958.9708 962.8703 978.8955 1002.9927 1007.7107 1044.4950 1051.8456 1063.5262 1076.4698 1077.2169 1110.9290 1117.9203 1162.5338 1173.5579 1200.1940 1202.5787 1239.3851 1251.2114 1261.4250 1264.7975 1286.8606 1290.4417 1308.4919 1313.6852 1327.8496 1332.5822 1333.5600 1344.4312 1346.6604 1352.5842 1352.9577 1374.6737 1399.3779 1426.4950 1459.2063 1459.3134 1466.5745 1472.0282 1475.7035 1484.5206 1588.0621 1647.5382 1651.9132 1659.7451 2969.6497 2970.3760 2974.9436 2990.8873 2997.3050 3007.9778 3022.0469 3027.8408 3032.7593 3034.6868 3043.4275 3064.1398 3073.8908 3075.8181 3087.4309 3098.9946 3200.3887 3517.3948
redmass: 4.7021 5.5782 3.9076 3.8528 3.3318 3.3626 7.5273 5.0618 3.2296 3.2490 4.5306 1.7979 3.9484 1.8006 2.9943 9.2559 3.6775 9.7831 2.3464 3.4730 3.2844 2.1562 5.5120 3.2025 4.7586 4.3509 2.3625 3.2524 6.0688 3.0306 1.6356 1.5168 2.7400 3.5835 2.5642 1.7851 1.7113 2.4272 1.5879 1.7310 1.7997 1.7462 1.8563 2.6745 1.1781 1.8232 4.2481 1.1163 3.9273 1.4570 2.5964 1.8883 2.5242 1.2496 1.7103 2.5062 1.3536 1.4257 1.2777 1.3831 1.5436 1.2554 1.3420 1.7533 1.6506 1.9968 1.3482 1.4638 1.4909 3.8498 1.3697 1.7020 1.6531 1.1586 1.1301 1.0891 1.0885 1.0862 1.0852 1.0922 10.3431 5.6544 9.8690 4.6913 1.0631 1.0628 1.0624 1.0622 1.0634 1.0625 1.0796 1.0859 1.0990 1.0947 1.1034 1.1010 1.0911 1.0993 1.0783 1.0863 1.1150 1.0767
irintensity: 1.2813 0.0762 0.0819 0.4419 0.0493 0.5530 10.7078 2.5758 0.5868 0.9213 6.1479 0.0771 4.1395 0.1816 4.6630 18.2401 1.4422 7.7421 3.5288 18.4361 2.3244 1.9756 20.1023 19.7430 3.1264 10.8946 9.0460 16.0452 0.0245 6.0314 101.2792 0.1299 11.0836 6.4356 2.5170 1.0592 2.8291 1.1654 20.6476 0.0065 28.8839 51.9774 2.5175 21.8808 16.1571 1.5266 3.5525 1.2803 36.1328 3.7003 0.0837 4.8625 4.6444 29.5235 6.9924 74.9188 37.9849 18.7957 0.9908 7.5661 45.4801 5.0006 1.2671 102.4666 51.0033 249.7411 0.8612 0.6683 25.1675 154.1836 8.1797 6.9222 38.4032 11.2191 39.0714 7.9974 6.2445 7.4005 16.2674 3.6821 335.1326 421.0953 110.8756 9.7370 32.5095 34.7965 32.0709 44.0280 26.6144 13.3111 2.8956 20.8761 58.0602 49.3336 43.2849 9.0315 1.9806 31.4404 16.3189 6.4391 17.6772 63.7460
temp: 298.150 k
press: 1.00000 atm
elementType: 8 8 8 7 7 6 6 6 6 6 6 6 6 6 6 6 6 6 1 1 1 1 1 1 1 1 1 1 1 1 1 1 1 1 1 1
symmnumber: 1
zpe: 779742.6 jmol-1
zpe.correction: 0.296988 hartree
zpe.thermalcorrener: 0.314074 hartree
zpe.thermalcorrenthalpy: 0.315018 hartree
zpe.thermalcorrgfe: 0.250888 hartree
zpe.sumelectzpe: -840.024346 hartree
zpe.sumelectthermal: -840.007260 hartree
zpe.sumelectthermalent: -840.006316 hartree
zpe.sumelectthermalfe: -840.070445 hartree
dipole: -1.3484 -0.9000 0.2915
dipole: 1.6472
quadrupole: -110.3998 -111.6993 -109.1252
quadrupole: -2.8629 2.2972 -5.7819
quadrupole: 0.0083 -1.2912 1.2829 -2.8629 2.2972 -5.7819
hfenergy: -840.3213338 hartree
pointgroup: C01 [X(C13H18N2O3)]
dipole: 0.4970992 0.3637023 0.2014594 debye
polarizability: 194.9528659|5.3670555|139.4579175|2.4022956|-7.630452|135.7880934 unknown
InChI: InChI=1S/C13H18N2O3/c1-2-6-10-11(16)14-13(18)15(12(10)17)9-7-4-3-5-8-9/h2,9-10,14H,1,3-8H2
charge 0 multiplicity 1
36 atoms
O  0.159304 1.488507 -1.507359
O  0.303021 -2.500362 0.964253
O  -3.695424 -1.403393 -1.090389
N  0.282713 -0.478513 -0.250227
N  -1.663057 -1.888185 -0.090379
C  1.737805 -0.258123 0.095316
C  2.645107 -0.242563 -1.158486
C  1.928485 1.001347 0.975708
C  4.126831 -0.106512 -0.726189
C  3.414623 1.124928 1.393663
C  4.345284 1.145839 0.15771
C  -0.412976 0.467469 -1.036504
C  -1.909363 0.259293 -1.28824
C  -0.315052 -1.663975 0.255903
C  -2.511226 -1.062338 -0.837396
C  -2.730089 1.456759 -0.670968
C  -2.582365 1.575369 0.831828
C  -3.584792 1.363618 1.720752
H  2.004788 -1.143388 0.701149
H  2.366818 0.604722 -1.808948
H  2.498827 -1.176612 -1.734511
H  1.283424 0.927482 1.872804
H  1.626398 1.901247 0.410537
H  4.768937 -0.058407 -1.626268
H  4.434754 -1.0106 -0.161022
H  3.690009 0.269383 2.044378
H  3.553935 2.043196 1.995385
H  5.403041 1.204152 0.478765
H  4.137363 2.056343 -0.440422
H  -2.053808 0.325242 -2.383868
H  -3.787577 1.304184 -0.948011
H  -2.363186 2.37506 -1.165937
H  -2.054995 -2.766728 0.265186
H  -1.588066 1.87095 1.201554
H  -3.428401 1.47438 2.799707
H  -4.590788 1.074831 1.392124
