program: Gaussian 09
title: 000150220
version: EM64L-G09RevD.01
frameworkgroup: C1[X(C18H11NO2)]
method: RPBEPBE
basis: SDD
operation: Freq
keyword: #p
keyword: freq=noraman
keyword: PBEPBE/SDD
title: #p freq=noraman PBEPBE/SDD
converged: NO YES NO YES
title: Mulliken charges:
elementType: O O N C C C C C C C C C C C C C C C C C C H H H H H H H H H H H
charge: -0.166768 -0.166771 -0.068347 0.115908 0.295043 0.138312 0.228852 0.481424 0.281486 0.440577 -0.444831 -0.652765 -0.527707 -0.334237 -0.333369 -0.445028 -0.449644 -0.255740 -0.276143 -0.247427 -0.250032 0.225293 0.258821 0.241193 0.223982 0.251443 0.251900 0.245399 0.232503 0.234818 0.236724 0.235131
chargesum: 0.00000
title: Mulliken charges with hydrogens summed into heavy atoms:
elementType: O O N C C C C C C C C C C C C C C C C C C
charge: -0.166768 -0.166771 -0.068347 0.115908 0.295043 0.138312 0.228852 0.481424 0.281486 0.440577 -0.219538 -0.393944 -0.286514 -0.110255 -0.081926 -0.193128 -0.204244 -0.023237 -0.041325 -0.010703 -0.014901
polarizability: 3.76617367e+02 -5.52079831e-01 2.23131650e+02 -6.59800482e-06 -1.48659065e-03 9.29367101e+01
1716.lowfreq: -52.4460 -0.0008 -0.0001 0.0009 6.5930 6.8211 12.7560 48.3928 67.4853
frequency: -52.4448 48.3772 67.4836 75.3174 143.4315 148.2486 188.5188 189.5728 241.5189 268.5727 282.3130 318.7799 362.3202 372.6432 405.5842 463.5133 470.9473 503.8816 512.4359 529.2793 536.4542 563.0368 565.0022 592.9728 635.6958 659.5164 679.8123 709.3235 713.3709 733.4795 740.7651 758.2003 775.0416 804.0029 826.9658 847.3590 852.8503 867.0795 876.4601 890.8543 908.9294 945.2826 949.0436 963.4088 982.1363 994.0738 996.1444 1020.4626 1041.3798 1061.1898 1090.6229 1142.8554 1165.4685 1180.0785 1192.2783 1208.8664 1233.4614 1242.0843 1265.9686 1274.5152 1276.0193 1311.2494 1326.3402 1370.2230 1375.1479 1395.7275 1413.7346 1414.0006 1428.8570 1440.5009 1458.8983 1486.7655 1528.2109 1533.5152 1572.5407 1601.4529 1616.1770 1627.5317 1629.2543 3125.6591 3129.7281 3131.3963 3139.8662 3142.6498 3145.7172 3159.2856 3164.3853 3170.5256 3181.2712 3251.4974
redmass: 7.7955 4.7126 4.4965 7.0464 4.3110 11.6800 4.8634 5.2776 5.1694 7.7778 4.2840 8.0053 3.7607 5.1051 3.1546 3.2843 7.2026 5.0531 2.9983 3.6932 7.2519 7.7617 3.3620 7.6952 3.4436 6.7903 6.6341 3.8512 8.8490 8.1884 1.5092 1.4893 1.8687 1.7204 5.8012 1.9278 5.5793 1.6164 1.8707 6.3916 1.8301 6.3236 1.3844 1.4117 1.3925 1.3718 1.3634 5.3789 2.2241 2.3039 3.1744 1.5594 1.3265 1.0987 1.2339 1.6728 2.5580 2.2264 2.4987 1.8332 2.2863 1.7929 3.3779 14.3406 4.0278 3.6114 4.8257 2.5801 2.8103 2.9583 2.1417 3.3549 3.4586 4.0607 7.7153 6.7597 6.0802 6.4030 6.5815 1.0878 1.0864 1.0890 1.0901 1.0910 1.0925 1.0951 1.0993 1.0992 1.0921 1.0900
irintensity: 0.3737 0.0368 0.6097 0.0604 0.0431 3.7873 0.5577 0.7090 4.6409 1.0705 0.6712 2.1254 0.0332 0.0277 5.9080 4.4688 3.7108 8.4984 0.0944 11.0892 2.3399 0.7987 0.0621 9.3447 6.1490 2.0889 4.1719 2.8916 8.1131 18.2988 7.5529 25.4943 107.0588 4.8662 1.5753 10.9749 1.7838 2.8384 31.3682 0.9970 23.1763 1.1171 0.0098 5.1654 0.0060 0.4956 1.3003 0.0245 10.0303 2.4072 0.3126 0.4068 7.6987 3.7163 1.0338 20.5199 29.6253 17.1823 8.3652 7.1543 27.3538 0.3205 4.3419 164.9449 0.9619 2.3834 4.4469 2.6695 3.7723 6.5676 0.7090 18.3334 1.1910 11.0184 0.6098 1.8544 3.3308 2.0365 1.4583 1.2444 2.8771 5.9481 9.3086 16.0791 2.6533 22.8655 33.7654 16.4703 28.5331 3.4264
temp: 298.150 k
press: 1.00000 atm
elementType: 8 8 7 6 6 6 6 6 6 6 6 6 6 6 6 6 6 6 6 6 6 1 1 1 1 1 1 1 1 1 1 1
symmnumber: 1
zpe: 625810.6 jmol-1
zpe.correction: 0.238359 hartree
zpe.thermalcorrener: 0.252843 hartree
zpe.thermalcorrenthalpy: 0.253787 hartree
zpe.thermalcorrgfe: 0.196772 hartree
zpe.sumelectzpe: -896.252976 hartree
zpe.sumelectthermal: -896.238492 hartree
zpe.sumelectthermalent: -896.237548 hartree
zpe.sumelectthermalfe: -896.294562 hartree
dipole: -1.9788 -3.9525 -0.0001
dipole: 4.4202
quadrupole: -94.1033 -115.3293 -131.4908
quadrupole: -6.9095 -0.0005 -0.0002
quadrupole: 19.5378 -1.6882 -17.8496 -6.9095 -0.0005 -0.0002
hfenergy: -896.4913343 hartree
pointgroup: C01 [X(C18H11N1O2)]
dipole: 0.7563786 -1.5659211 0.0003474 debye
polarizability: 376.6021059|-1.6269415|223.1469063|-0.0065455|-0.0260829|92.9367155 unknown
InChI: InChI=1S/C18H11NO2/c20-19(21)17-11-13-6-2-3-7-14(13)16-10-9-12-5-1-4-8-15(12)18(16)17/h1-11H
charge 0 multiplicity 1
32 atoms
O  -0.918711 3.189386 -1.142492
O  -0.918572 3.189975 1.140846
N  -0.608187 2.676792 -0.00071
C  -0.359973 0.106607 -0.000148
C  0.59594 -0.976427 0.000053
C  2.03914 -0.72916 -0.000021
C  -1.801798 -0.191947 -0.000037
C  2.526248 0.626363 -0.000315
C  0.217945 1.435739 -0.000446
C  -2.22025 -1.578846 0.000241
C  0.112311 -2.333494 0.000336
C  1.576552 1.69552 -0.000537
C  -1.236141 -2.624522 0.000416
C  3.015707 -1.777536 0.000192
C  -2.848999 0.789545 -0.000178
C  3.930681 0.897277 -0.000406
C  -3.607356 -1.924732 0.000352
C  4.387177 -1.496844 0.000109
C  -4.202249 0.427681 -0.00005
C  4.854899 -0.149456 -0.000204
C  -4.595822 -0.939152 0.000213
H  0.827473 -3.158617 0.000484
H  1.93287 2.731275 -0.00076
H  -1.578678 -3.66567 0.000627
H  2.704272 -2.8250 0.000434
H  -2.639468 1.855456 -0.000374
H  4.268601 1.939799 -0.000646
H  -3.879322 -2.986742 0.000561
H  5.108571 -2.321079 0.000285
H  -4.963674 1.214836 -0.000151
H  5.929971 0.05787 -0.000281
H  -5.656961 -1.208996 0.000304
