program: Gaussian 09
title: 000150207
version: EM64L-G09RevD.01
frameworkgroup: C1[X(C23H23ClN4O2S)]
method: RPBEPBE
basis: SDD
operation: Freq
keyword: #p
keyword: freq=noraman
keyword: PBEPBE/SDD
title: #p freq=noraman PBEPBE/SDD
converged: YES YES NO NO
title: Mulliken charges:
elementType: Cl S O O N N N N C C C C C C C C C C C C C C C C C C C C C C C H H H H H H H H H H H H H H H H H H H H H H H
charge: -0.048122 0.970755 -0.540156 -0.549042 -0.490779 -0.022765 -0.252188 -0.475803 0.238216 0.240341 0.241758 -0.274527 0.271573 0.220370 -0.056865 0.434865 -0.368591 -0.375695 -0.290793 0.252031 -0.370223 -0.394069 -0.442427 -0.298320 -0.262650 -0.795835 -0.258590 -0.116255 -0.642082 -0.639945 -0.769350 0.343718 0.267831 0.289281 0.271850 0.235923 0.230985 0.240377 0.290589 0.231578 0.247075 0.209237 0.243900 0.258413 0.262462 0.230212 0.224382 0.252577 0.260607 0.211683 0.228133 0.263576 0.296832 0.273943
chargesum: 0.00000
title: Mulliken charges with hydrogens summed into heavy atoms:
elementType: Cl S O O N N N N C C C C C C C C C C C C C C C C C C C C C C C
charge: -0.048122 0.970755 -0.540156 -0.549042 -0.147061 -0.022765 -0.252188 -0.213341 0.238216 0.240341 0.241758 -0.274527 0.271573 0.220370 -0.056865 0.434865 -0.100760 -0.086414 -0.018943 0.252031 -0.134300 -0.163084 -0.202050 -0.007731 -0.031072 -0.095624 -0.000177 -0.116255 0.065089 0.060478 0.065001
polarizability: 6.65829857e+02 -1.14813278e+01 4.15314188e+02 -1.48301032e+01 -2.01611138e+00 2.50261981e+02
1716.lowfreq: -4.0997 -3.2085 -0.0023 -0.0019 -0.0015 3.4061 13.3328 18.2108 22.1695
frequency: 13.2600 18.1492 22.1152 32.9545 39.2310 47.9463 64.4853 78.3177 84.8905 96.6064 103.9011 109.7965 126.7433 135.9784 146.9505 148.8773 160.0811 162.8200 189.8554 203.3717 211.4382 226.8483 232.7015 241.9165 244.6645 264.9448 272.5351 295.3269 311.4928 321.6105 331.2615 336.7478 348.8799 366.1862 374.2824 393.1541 398.7781 424.5770 452.2479 466.4810 481.0591 488.8871 510.4412 516.2141 528.7526 536.2837 544.3163 559.0514 573.5681 605.0901 620.5963 634.1720 640.5131 686.8788 693.0038 694.4673 728.1539 744.1852 768.6430 773.6483 794.2485 799.7230 804.5360 812.7597 822.1996 835.2339 851.9008 874.6213 880.0983 883.4813 893.9649 895.9362 908.3797 909.9084 941.8439 946.7406 954.2052 962.2070 976.8150 981.4880 1001.3450 1016.1113 1040.2558 1049.6907 1058.6221 1083.8150 1087.5755 1088.8692 1119.1540 1141.5626 1150.5343 1174.5154 1178.5442 1179.4372 1185.0242 1217.7214 1227.6927 1242.8778 1259.0147 1260.8551 1281.0562 1288.6150 1303.6655 1318.5003 1324.7626 1351.9888 1378.5523 1392.4968 1400.2416 1410.0720 1416.5543 1419.6296 1424.5712 1426.4917 1437.2831 1440.2758 1447.3011 1450.0137 1458.2380 1461.6253 1466.6251 1476.1485 1478.5573 1481.0328 1498.2701 1509.0785 1524.2569 1544.3997 1560.9902 1563.4089 1600.5315 1602.0862 1621.7694 2928.2728 2933.8238 2989.4043 3027.7175 3041.9857 3043.0688 3071.8772 3093.8828 3097.2605 3107.0097 3123.6114 3127.9786 3135.6152 3146.8191 3167.0568 3170.2308 3173.8266 3177.7148 3181.4066 3181.8584 3183.3931 3330.5778 3348.9647
redmass: 9.2600 6.4530 4.5743 5.0510 4.7855 4.9310 5.4746 3.0874 4.5479 5.5966 4.6574 4.6007 6.8541 1.1309 2.1516 2.5353 3.1201 2.1450 4.4996 4.3142 1.2430 3.4949 1.5818 4.0131 2.5013 3.5929 3.9368 8.7775 6.9236 4.4062 5.3526 5.4857 3.1615 6.1983 4.7934 3.8756 4.8732 3.3926 5.5412 4.3771 3.9381 3.9739 3.7312 3.9601 6.2265 8.4948 3.8710 5.9326 5.3894 4.6686 5.3620 5.1734 4.7513 5.9783 5.5309 6.8089 2.9492 3.4550 1.4834 1.5299 4.3698 1.7052 7.5255 1.4293 3.5863 3.7871 1.5480 5.4271 3.6475 2.0849 1.5270 1.6434 1.4155 4.6579 1.3182 1.3217 1.3350 2.7479 2.5443 1.3389 2.2019 2.3289 1.6522 1.5653 2.0767 1.9610 1.7931 1.4469 2.2310 1.4600 1.4524 1.2519 2.4960 1.5940 1.3216 2.2954 1.9099 3.0487 1.9426 1.8015 1.1374 4.7997 1.6766 2.4902 2.9358 2.8735 3.9329 3.9227 1.3053 1.0592 1.0623 2.5994 3.3967 1.2380 2.3324 2.3711 2.4513 1.0470 1.5999 1.2345 1.5341 1.1558 1.1825 1.3561 1.1659 3.4025 8.7424 6.4531 7.0764 4.2091 6.4597 6.3289 6.0069 1.0484 1.0471 1.0360 1.0239 1.0842 1.0864 1.0962 1.1011 1.1009 1.1010 1.0895 1.0877 1.0886 1.0912 1.0949 1.0967 1.0958 1.1071 1.0934 1.1080 1.0922 1.0752 1.0736
irintensity: 1.9840 3.4045 0.4766 0.0773 1.2821 1.3295 0.4863 0.8389 3.9672 5.3125 11.0857 2.4783 89.5495 0.7570 1.7123 1.9210 3.6965 0.0214 37.6276 4.5568 4.9554 4.9130 2.5922 0.7708 0.4359 6.4862 0.2647 6.4568 11.6858 5.1262 19.7327 3.4664 2.0084 19.1500 7.3448 0.7281 18.7993 6.8720 11.4067 13.9848 43.1463 22.3671 10.0874 3.5683 2.6202 43.1679 0.1683 5.3854 9.0565 3.9008 7.5714 24.4435 9.6420 26.7555 0.9194 9.7726 95.2722 1.1820 39.3830 194.5416 45.0111 18.3882 87.0096 12.6561 6.3326 25.6583 102.0281 14.7978 9.9307 24.5509 16.8633 9.7957 8.5032 76.0186 20.6956 125.7203 0.6429 10.7268 42.9018 1.3533 51.4712 1.2301 14.8011 7.9213 31.5923 32.8787 9.8173 11.7951 27.2048 11.0524 1.0927 3.6206 38.5209 4.5470 2.5353 27.4221 15.4358 54.7623 9.9934 14.3715 13.2986 8.2836 6.1220 9.9556 70.5346 127.2874 14.0467 105.8066 20.1661 5.2654 9.1642 13.5914 53.3765 24.4860 19.9480 30.2652 116.9196 13.2031 92.1628 34.8591 83.8809 32.4476 20.1992 66.7416 93.5837 514.5058 151.4024 7.3536 54.4634 59.4899 102.3323 272.3409 32.0577 41.7769 145.7721 35.8517 0.9809 32.1662 16.8398 11.7324 27.2954 15.0962 22.1215 7.9420 17.5625 4.9966 19.4205 9.2189 15.4709 3.7711 0.1456 1.3954 1.3459 0.7760 15.2246 112.4246
temp: 298.150 k
press: 1.00000 atm
elementType: 17 16 8 8 7 7 7 7 6 6 6 6 6 6 6 6 6 6 6 6 6 6 6 6 6 6 6 6 6 6 6 1 1 1 1 1 1 1 1 1 1 1 1 1 1 1 1 1 1 1 1 1 1 1
symmnumber: 1
zpe: 1081820.6 jmol-1
zpe.correction: 0.412044 hartree
zpe.thermalcorrener: 0.442643 hartree
zpe.thermalcorrenthalpy: 0.443587 hartree
zpe.thermalcorrgfe: 0.347772 hartree
zpe.sumelectzpe: -2115.448299 hartree
zpe.sumelectthermal: -2115.417701 hartree
zpe.sumelectthermalent: -2115.416756 hartree
zpe.sumelectthermalfe: -2115.512571 hartree
dipole: -2.9853 1.7793 0.1509
dipole: 3.4786
quadrupole: -272.9112 -187.3008 -178.0430
quadrupole: -6.6655 -7.3129 -4.8821
quadrupole: -60.1595 25.4508 34.7087 -6.6655 -7.3129 -4.8821
hfenergy: -2115.860343 hartree
pointgroup: C01 [X(C23H23Cl1N4O2S1)]
dipole: -1.2734837 0.4866951 -0.1200164 debye
polarizability: 662.4015042|20.873857|391.374318|-28.2585174|-61.8922618|277.6302036 unknown
InChI: InChI=1S/C22H20ClN4.CH3O2S/c1-13-5-4-6-17-21(13)26-19-11-14(23)7-9-16(19)22(17)25-18-10-8-15(24)12-20(18)27(2)3;1-4(2)3/h4-12,24-25H,1-3H3;1H3
charge 0 multiplicity 1
54 atoms
Cl -4.667254 -5.104413 1.160738
S  6.082604 -0.207827 -1.254927
O  7.50868 0.233584 -1.903123
O  5.98827 -0.842447 0.245686
N  -0.193923 0.137873 0.953206
N  -4.213432 -0.22581 -0.520106
N  1.954244 0.274435 2.588238
N  4.844489 1.488529 -1.211314
C  -1.49746 0.042306 0.426092
C  -2.160268 1.15216 -0.196976
C  -2.209044 -1.1915 0.594458
C  -3.523394 0.947605 -0.684403
C  0.99013 0.581066 0.348114
C  2.152225 0.618245 1.202893
C  -3.585178 -1.259322 0.120141
C  -4.221669 2.036793 -1.347864
C  -1.575749 2.460557 -0.304824
C  3.407013 0.915311 0.650708
C  1.125963 0.870976 -1.03723
C  3.551056 1.180383 -0.745419
C  -1.624491 -2.367082 1.18106
C  2.391609 1.140085 -1.580767
C  -3.585985 3.274376 -1.457333
C  -4.333117 -2.474812 0.30928
C  -2.27457 3.494098 -0.920239
C  -5.618128 1.805361 -1.879412
C  -2.363154 -3.536325 1.348493
C  -3.726403 -3.562598 0.915393
C  1.316429 1.340752 3.41418
C  3.109807 -0.34783 3.276679
C  5.298911 -1.534627 -2.428234
H  0.013468 -0.350672 1.840027
H  -0.579128 2.646997 0.103848
H  4.304091 0.952975 1.27342
H  0.247631 0.834264 -1.687411
H  -0.570893 -2.366518 1.480804
H  2.489919 1.3284 -2.657439
H  -4.107926 4.102985 -1.9498
H  -5.367401 -2.496144 -0.042065
H  -1.824035 4.489964 -0.992565
H  -6.302525 1.502394 -1.067069
H  -6.013643 2.715102 -2.362594
H  -5.631133 0.975482 -2.608307
H  -1.913723 -4.430591 1.788959
H  4.860306 1.777625 -2.211993
H  0.986626 0.911603 4.376891
H  2.022557 2.174236 3.623186
H  0.435736 1.753729 2.895374
H  3.564945 -1.114646 2.629512
H  3.898851 0.387011 3.551917
H  2.753983 -0.828719 4.205044
H  5.401036 -1.148756 -3.451766
H  5.890974 -2.445752 -2.263978
H  4.253375 -1.655571 -2.112484
