program: Gaussian 09
title: 000150188
version: EM64L-G09RevD.01
frameworkgroup: C1[X(C3H3Cl4F)]
method: RPBEPBE
basis: SDD
operation: Freq
keyword: #p
keyword: freq=noraman
keyword: PBEPBE/SDD
title: #p freq=noraman PBEPBE/SDD
converged: NO YES NO NO
title: Mulliken charges:
elementType: Cl Cl Cl Cl F C C C H H H
charge: 0.039295 0.071147 0.087787 -0.002848 -0.087528 -0.292488 -0.195809 -0.546471 0.341339 0.285310 0.300266
chargesum: 0.00000
title: Mulliken charges with hydrogens summed into heavy atoms:
elementType: Cl Cl Cl Cl F C C C
charge: 0.039295 0.071147 0.087787 -0.002848 -0.087528 0.048851 -0.195809 0.039104
polarizability: 7.38859093e+01 -5.27284162e+00 7.65676240e+01 5.27401456e+00 4.29336918e+00 5.52764741e+01
1716.lowfreq: -7.6204 -0.0043 -0.0035 -0.0030 4.1709 6.1360 61.9577 71.8075 137.8781
frequency: 61.9519 71.7862 137.8773 164.0409 207.7706 224.9480 259.0370 321.5104 345.6586 401.9007 458.3812 583.4014 640.2811 705.6983 749.8102 922.8943 967.8763 1050.7343 1095.2050 1159.2857 1247.0281 1260.4595 1318.9350 1437.3354 3070.2378 3087.7498 3158.9765
redmass: 24.1831 7.3050 15.5388 11.1914 7.8386 17.8652 11.1512 8.2045 24.7165 6.7779 8.3789 6.6592 4.9352 6.8630 7.0692 1.6081 10.2400 5.9500 2.3097 1.3861 1.1864 1.1620 1.2950 1.0875 1.0575 1.0858 1.1092
irintensity: 0.1365 2.7304 2.1775 1.7935 1.7292 1.0768 1.4637 0.0150 0.9952 9.0689 3.7781 63.9608 70.6265 50.0246 147.6249 13.5463 113.8416 30.3953 33.1459 6.6883 3.2419 24.6292 8.3335 12.7449 4.9066 3.3156 0.4469
temp: 298.150 k
press: 1.00000 atm
elementType: 17 17 17 17 9 6 6 6 1 1 1
symmnumber: 1
zpe: 150195.8 jmol-1
zpe.correction: 0.057207 hartree
zpe.thermalcorrener: 0.066516 hartree
zpe.thermalcorrenthalpy: 0.067460 hartree
zpe.thermalcorrgfe: 0.020717 hartree
zpe.sumelectzpe: -2055.553088 hartree
zpe.sumelectthermal: -2055.543779 hartree
zpe.sumelectthermalent: -2055.542834 hartree
zpe.sumelectthermalfe: -2055.589578 hartree
dipole: 0.1772 -1.4274 0.7248
dipole: 1.6106
quadrupole: -82.0995 -75.0400 -72.1067
quadrupole: -0.7710 0.9299 0.9468
quadrupole: -5.6841 1.3754 4.3087 -0.7710 0.9299 0.9468
hfenergy: -2055.6102946 hartree
pointgroup: C01 [X(C3H3Cl4F1)]
dipole: -0.0124853 0.6100551 0.1709021 debye
dipolederiv: -0.1911202 0.1114212 -0.0069715 0.0807225 -0.4782471 -0.0206395 -0.0161767 0.024639 -0.0909879 -0.2595615 0.2070485 -0.0420386 0.1357387 -0.6720469 0.2122091 -0.0218681 0.181533 -0.2266205 -0.2123791 -0.0035532 0.1394056 -0.0087953 -0.1387933 0.0964286 0.11504 0.0920219 -0.679066 -0.4664552 -0.0512559 0.0388853 -0.0390177 -0.1263662 -0.0098641 0.0940542 0.0047379 -0.1595116 -0.5239527 -0.2209433 -0.2016419 -0.1617194 -0.5452827 -0.2128285 -0.1476099 -0.2181963 -0.5017069 0.0432309 -0.1880768 -0.0009005 -0.0341946 0.6034979 0.0280215 0.2027732 -0.0164183 -0.0986747 0.9601472 -0.0219157 0.1001147 -0.0820031 1.2846311 -0.1408822 -0.0683236 -0.0814943 1.4912317 0.5891414 0.1164321 -0.1527115 0.0497845 -0.002464 -0.0261041 -0.1688247 -0.0349211 0.1473673 0.0495738 0.0393581 0.0334148 0.0279508 -0.0013735 0.0195103 -0.0306929 0.0243765 0.0278707 0.010358 0.0351159 0.0322809 0.0315502 -0.0268729 -0.0017888 0.023909 0.0009812 0.1004687 0.0010173 -0.023631 0.0601627 -0.0000165 0.1033176 0.0559375 0.0177195 0.0227404 -0.0103708 unknown
polarizability: 72.1283436|-6.753128|74.9655334|-5.8944008|-7.2144684|58.6361303 unknown
InChI: InChI=1S/C3H3Cl4F/c4-1-2(5)3(6,7)8/h2H,1H2
charge 0 multiplicity 1
11 atoms
Cl 0.899437 -1.950478 -0.099969
Cl -1.525119 1.79311 -0.64227
Cl -1.465064 -0.166281 1.691901
Cl 3.115777 0.716602 -0.234417
F  -1.821059 -0.835788 -0.858037
C  0.463577 -0.146461 -0.392313
C  -1.035099 0.060423 -0.099681
C  1.372709 0.753661 0.445235
H  0.61733 0.013823 -1.472199
H  1.049057 1.803587 0.386835
H  1.432153 0.416402 1.488515
