program: Gaussian 09
title: 000150175
version: EM64L-G09RevD.01
frameworkgroup: C1[X(C11H11NO5)]
method: RPBEPBE
basis: SDD
operation: Freq
keyword: #p
keyword: freq=noraman
keyword: PBEPBE/SDD
title: #p freq=noraman PBEPBE/SDD
converged: YES YES NO NO
title: Mulliken charges:
elementType: O O O O O N C C C C C C C C C C C H H H H H H H H H H H
charge: -0.295844 -0.286876 -0.235564 -0.198194 -0.199963 0.027976 -0.093260 -0.036181 -0.294321 -0.693587 0.206476 0.234755 -0.319490 -0.309017 0.388653 -0.348597 -0.343358 0.241119 0.225127 0.242991 0.253274 0.236345 0.232017 0.219383 0.283017 0.280023 0.292719 0.290379
chargesum: 0.00000
title: Mulliken charges with hydrogens summed into heavy atoms:
elementType: O O O O O N C C C C C C C C C C C
charge: -0.295844 -0.286876 -0.235564 -0.198194 -0.199963 0.027976 0.147859 0.188946 0.201944 -0.005842 0.206476 0.234755 -0.036473 -0.028994 0.388653 -0.055878 -0.052980
polarizability: 2.20595946e+02 -6.84989326e+00 1.54273018e+02 -1.13128757e-01 -3.15877690e+00 7.56479598e+01
1716.lowfreq: -10.3352 -3.7603 -2.3043 -0.0003 0.0005 0.0008 8.0756 27.6106 45.5670
frequency: 7.8821 27.6019 45.5591 53.5392 69.9484 80.8579 121.8025 159.5112 187.3138 208.3971 220.3746 261.3769 271.0352 278.6532 329.0855 400.9453 410.2500 458.3169 462.5205 488.8806 493.3725 528.3401 623.2177 652.9001 675.5777 685.4173 699.2756 764.8621 773.8325 779.4737 813.3691 863.4825 888.5608 902.7236 913.3570 954.6695 1003.3747 1005.2620 1007.7424 1011.8078 1060.9749 1073.3946 1089.6193 1109.2897 1119.4112 1126.4577 1142.5613 1176.3790 1194.3882 1213.5850 1237.3753 1246.0831 1293.1711 1315.1130 1355.2141 1368.8066 1397.2097 1404.8780 1415.4393 1441.7965 1466.2480 1468.3138 1474.5237 1475.5345 1591.1182 1609.4304 1625.2887 2987.7645 3019.7375 3077.8980 3081.8344 3084.0803 3101.7374 3108.4744 3165.0108 3175.7890 3188.1468 3193.4884
redmass: 4.2355 4.9305 6.4286 7.6162 5.1201 7.2932 5.5848 3.4299 1.2193 5.7949 6.5635 4.1013 2.8105 6.9362 5.2094 5.0086 2.8802 4.0858 3.1371 8.2968 6.7124 6.1255 7.1319 6.1803 7.8521 3.8925 6.1060 5.0327 9.1145 3.0266 7.5852 1.2475 1.6675 6.6104 2.6746 1.2977 1.3524 2.8843 1.3950 1.3675 4.0176 1.7398 3.2670 1.3309 1.4791 2.7903 1.7668 1.2299 1.2327 6.5976 1.7233 2.5181 1.2601 1.2285 1.4465 7.8488 1.2394 7.9837 4.5824 1.6911 1.2113 1.1484 1.9367 1.3424 8.8568 6.3806 10.9879 1.0364 1.0574 1.0941 1.0960 1.1038 1.0991 1.0931 1.0902 1.0890 1.0958 1.0974
irintensity: 0.0395 2.2476 0.5607 3.4630 0.5763 1.2600 0.8196 7.6664 1.7084 7.8544 7.1442 0.4168 0.5007 4.3306 1.3096 23.4208 0.0021 1.2989 3.0559 4.7109 3.6162 3.3702 0.3854 0.0265 3.4595 57.7176 6.5208 3.6719 40.6028 19.6224 8.9187 0.8668 53.6610 16.4839 22.8783 18.7374 0.8621 21.5969 53.8060 0.1369 305.9085 40.9408 11.2472 10.1129 1.8943 4.1588 2.8574 4.1157 6.6503 488.9215 50.5664 136.0372 0.3663 5.0984 2.7230 83.7550 19.3577 11.4035 65.6169 11.7506 5.7283 16.8586 7.6540 6.9326 42.8151 2.9926 149.9838 16.6585 10.1400 4.6829 24.5754 5.8816 7.3228 55.4617 1.3170 1.1360 0.5791 0.6584
temp: 298.150 k
press: 1.00000 atm
elementType: 8 8 8 8 8 7 6 6 6 6 6 6 6 6 6 6 6 1 1 1 1 1 1 1 1 1 1 1
symmnumber: 1
zpe: 539874.9 jmol-1
zpe.correction: 0.205627 hartree
zpe.thermalcorrener: 0.221762 hartree
zpe.thermalcorrenthalpy: 0.222706 hartree
zpe.thermalcorrgfe: 0.158020 hartree
zpe.sumelectzpe: -855.271682 hartree
zpe.sumelectthermal: -855.255547 hartree
zpe.sumelectthermalent: -855.254603 hartree
zpe.sumelectthermalfe: -855.319289 hartree
dipole: 3.0910 1.4839 0.2961
dipole: 3.4415
quadrupole: -134.2648 -100.2986 -95.2596
quadrupole: 19.2750 2.7271 0.7279
quadrupole: -24.3238 9.6424 14.6814 19.2750 2.7271 0.7279
hfenergy: -855.4773092 hartree
pointgroup: C01 [X(C11H11N1O5)]
dipole: -1.1936245 -0.6333787 0.0862251 debye
polarizability: 220.9854022|-4.3681458|153.1273883|-1.5844023|8.2417895|76.404134 unknown
InChI: InChI=1S/C11H11NO5/c1-7-10(17-7)6-16-11(13)8-2-4-9(5-3-8)12(14)15/h2-5,7,10H,6H2,1H3
charge 0 multiplicity 1
28 atoms
O  -5.46206 -0.087253 -0.221869
O  -1.722488 0.391842 -0.153339
O  -1.007604 2.572011 0.260292
O  5.610889 0.12609 0.039981
O  4.810872 -1.973143 -0.356085
N  4.646426 -0.711746 -0.139359
C  -3.999142 -0.27827 -0.549922
C  -4.648129 -1.187596 0.449156
C  -3.133929 0.883298 -0.12142
C  -5.04244 -2.607549 0.112548
C  -0.741823 1.364263 0.052315
C  0.637844 0.78903 -0.005026
C  1.731187 1.672918 0.189239
C  0.867585 -0.590984 -0.243769
C  3.253111 -0.189251 -0.093015
C  3.050657 1.187838 0.146077
C  2.182983 -1.0894 -0.289188
H  -3.815442 -0.666059 -1.560841
H  -4.459463 -0.971255 1.510829
H  -3.380413 1.218286 0.901506
H  -3.226302 1.746961 -0.803999
H  -5.962106 -2.896565 0.651377
H  -5.230059 -2.717618 -0.969322
H  -4.238475 -3.309252 0.403868
H  1.524338 2.731908 0.371602
H  0.014207 -1.257272 -0.391072
H  3.913302 1.842678 0.291494
H  2.395272 -2.14591 -0.470758
