program: Gaussian 09
title: 000013453
version: EM64L-G09RevD.01
frameworkgroup: C1[X(C13H10O3)]
method: RPBEPBE
basis: SDD
operation: Freq
keyword: #pfreq=noraman
keyword: PBEPBE/SDD
title: #p freq=noraman PBEPBE/SDD
converged: YES YES NO YES
title: Mulliken charges:
elementType: O O O C C C C C C C C C C C C C H H H H H H H H H H
charge: -0.238369 -0.238370 -0.276414 0.348564 0.348565 -0.274447 -0.274447 -0.385729 -0.385729 -0.293765 -0.293766 0.177877 -0.254064 -0.254064 -0.162273 -0.162272 0.278815 0.278815 0.264545 0.264545 0.243847 0.243848 0.257868 0.257868 0.264276 0.264276
chargesum: 0.00000
title: Mulliken charges with hydrogens summed into heavy atoms:
elementType: O O O C C C C C C C C C C C C C
charge: -0.238369 -0.238370 -0.276414 0.348564 0.348565 0.004368 0.004368 -0.121184 -0.121184 -0.049918 -0.049918 0.177877 0.003804 0.003804 0.102003 0.102003
polarizability: 4.47023602e+02 2.95511227e-06 1.47492258e+02 -4.59539140e-05 6.76896239e-03 5.91589335e+01
1716.lowfreq: -3.9827 -0.0009 -0.0005 0.0006 2.7328 5.3286 34.3057 39.2183 43.3454
frequency: 34.2927 39.2183 43.3445 94.9788 99.9897 104.3498 148.5482 185.0794 245.6059 250.8658 262.5832 331.8329 336.0917 433.2147 522.1263 584.8797 585.0291 621.1855 625.4212 650.5398 705.8107 727.9074 739.5196 739.7439 799.1383 813.5511 818.7835 868.3424 868.5168 869.1920 875.7859 876.2291 885.4503 887.5585 913.3941 950.8801 986.6670 995.8360 1018.2012 1019.6972 1049.0702 1054.2180 1112.3274 1133.7644 1134.0782 1185.2562 1191.7444 1251.5659 1252.8649 1267.9526 1268.2479 1303.1954 1316.3977 1369.9771 1372.2095 1464.3990 1469.5834 1507.1544 1541.9258 1545.5192 1635.3065 1655.3678 3117.2847 3117.9611 3134.8189 3142.6062 3220.9179 3220.9359 3235.8362 3235.8517 3266.7974 3266.8000
redmass: 4.8331 6.0178 4.2142 5.5828 6.6840 5.3545 3.9449 7.5198 2.9202 5.4840 10.2805 3.1227 2.9421 4.6463 4.2775 2.9482 2.9615 3.7944 8.6819 4.3213 4.7667 5.5001 1.2677 1.2666 3.9093 1.3192 1.3703 6.6486 6.4949 1.6878 4.5162 4.3758 1.3756 1.4214 2.1205 4.3836 1.1264 1.1178 1.5859 1.6072 2.5624 2.5036 1.8974 1.5941 1.5949 1.4852 1.6205 1.4646 2.6478 1.5010 4.1860 1.3364 2.5858 2.5783 2.6862 5.1858 4.9598 10.7837 5.4105 5.6677 6.7061 6.5930 1.0907 1.0908 1.0905 1.0905 1.0924 1.0924 1.0980 1.0980 1.1085 1.1085
irintensity: 3.2819 1.3343 0.0000 0.0000 1.5330 1.0082 3.9379 0.0130 0.0000 0.0671 7.1380 0.0000 8.9761 3.5847 8.6995 0.0000 19.2198 1.0269 77.6732 0.0000 0.1881 1.7567 0.0021 173.1952 8.4639 0.0000 56.8911 28.6368 0.0062 0.0000 16.1858 12.5611 0.0160 0.0001 14.5928 0.4182 0.0000 109.8095 39.0319 19.2450 164.9642 1.0409 134.8552 3.3178 9.6152 14.4198 85.5138 1.2045 30.3894 138.4874 12.5875 2.4555 136.2273 5.2658 74.7767 44.0754 1.4415 128.9384 2.1641 225.3948 787.9468 2.8686 1.0093 0.0645 3.9668 8.8446 8.1909 1.8222 2.7091 0.1718 0.0470 0.0450
temp: 298.150 k
press: 1.00000 atm
elementType: 8 8 8 6 6 6 6 6 6 6 6 6 6 6 6 6 1 1 1 1 1 1 1 1 1 1
symmnumber: 1
zpe: 506028.3 jmol-1
zpe.correction: 0.192736 hartree
zpe.thermalcorrener: 0.206610 hartree
zpe.thermalcorrenthalpy: 0.207554 hartree
zpe.thermalcorrgfe: 0.149617 hartree
zpe.sumelectzpe: -725.864146 hartree
zpe.sumelectthermal: -725.850273 hartree
zpe.sumelectthermalent: -725.849328 hartree
zpe.sumelectthermalfe: -725.907266 hartree
dipole: 0.0000 -2.4728 0.0010
dipole: 2.4728
quadrupole: -45.2335 -89.0854 -98.4621
quadrupole: 0.0000 -0.0001 0.0028
quadrupole: 32.3602 -11.4918 -20.8684 0.0000 -0.0001 0.0028
hfenergy: -726.0568822 hartree
pointgroup: C01 [X(C13H10O3)]
dipole: -0.0000126 0.9728348 -0.010659 debye
dipolederiv: -0.3191537 0.2324246 -0.0023671 0.3134026 -0.3888558 0.002787 -0.0031171 0.0027565 -0.1264682 -0.3191441 -0.232423 0.0023669 -0.3133994 -0.3888671 0.0027584 0.0031036 0.0027427 -0.1264685 -0.9877514 -0.0000002 -0.0000187 -0.0000003 -0.9889485 0.0066824 -0.0000163 0.0067178 -0.3500188 -0.6969573 -0.2670125 0.0028379 -0.1675044 0.2340915 -0.0021133 0.0016205 -0.002048 0.0388273 -0.6969654 0.2669952 -0.0028799 0.1674838 0.2341004 -0.002092 -0.001686 -0.0020363 0.0388269 1.346935 0.2021903 -0.0021793 0.0104075 0.089515 -0.0015963 -0.0002264 -0.0016043 -0.0685474 1.3469374 -0.2021663 0.0022622 -0.0103829 0.0895107 -0.0015973 0.0003205 -0.0016156 -0.0685472 0.4583336 0.1652791 -0.0017962 0.179539 0.076121 -0.0027785 -0.0022174 -0.002782 -0.1883954 0.4583416 -0.1652721 0.0018303 -0.1795307 0.0761159 -0.0027787 0.0022485 -0.0027838 -0.1883946 -1.865557 -0.3346756 0.0035115 0.1022936 0.031105 -0.0023946 -0.0011398 -0.0024024 -0.2076662 -1.86556 0.3346391 -0.0036099 -0.1023295 0.0311091 -0.0023976 0.0010297 -0.002378 -0.2076665 3.0095252 0.0000202 0.0000829 0.0000199 0.9275956 -0.0078918 0.0000723 -0.0078743 0.1799002 0.0631039 0.0431815 -0.0004771 -0.5449584 -0.2452309 0.0004079 0.0058593 0.0003956 -0.2080829 0.0630931 -0.0431754 0.0004896 0.5449654 -0.2452226 0.0004382 -0.0058526 0.0003961 -0.2080835 -0.3624604 -0.2453843 0.0024922 -0.1816592 0.1582445 -0.0028613 0.001818 -0.0029559 -0.1119656 -0.3624682 0.2453741 -0.0025184 0.1816478 0.1582541 -0.0028516 -0.0018413 -0.0029216 -0.1119657 0.1273357 0.0030477 -0.0000235 0.0087554 0.003141 0.0016097 0.000029 0.0016312 0.1611621 0.1273358 -0.0030452 0.0000218 -0.0087528 0.0031406 0.0016071 -0.0000188 0.0016273 0.1611622 0.1458505 0.0037737 -0.0000225 0.0132878 -0.0136797 0.0022423 -0.0000634 0.0022216 0.2004479 0.1458506 -0.0037712 0.0000206 -0.0132854 -0.0136808 0.0022345 0.0000716 0.0022144 0.2004478 0.065062 0.0159015 -0.0001567 -0.0272247 -0.0627705 0.0024171 0.0001296 0.0024038 0.17521 0.0650618 -0.0158989 0.0001505 0.0272272 -0.06277 0.0024164 -0.0001289 0.0023996 0.1752102 -0.0637687 -0.0162148 0.0001999 -0.019407 0.1302873 0.0007671 0.000213 0.0007757 0.2025405 -0.0637686 0.0162109 -0.0002116 0.0194029 0.130288 0.0007666 -0.0002302 0.000773 0.2025407 0.0903945 -0.0037517 0.0000637 -0.0128047 0.018703 0.0021079 0.0002196 0.0021809 0.2179974 0.0903941 0.0037533 -0.0000689 0.0128064 0.0187031 0.0021106 -0.0001969 0.0021659 0.2179974 unknown
polarizability: 447.0236018|0.0029049|147.4825437|0.0112325|-0.9263009|59.168648 unknown
InChI: InChI=1S/C13H10O3/c14-11(5-7-12-3-1-9-15-12)6-8-13-4-2-10-16-13/h1-10H
charge 0 multiplicity 1
26 atoms
O  3.840852 1.269261 -0.003934
O  -3.840874 1.269187 -0.004154
O  0.000021 -2.225495 0.032881
C  3.766962 -0.150652 0.010958
C  -3.766959 -0.150726 0.010744
C  2.479813 -0.786801 0.017659
C  -2.479798 -0.786849 0.017512
C  5.068927 -0.663187 0.016343
C  -5.068914 -0.663284 0.01602
C  1.258317 -0.158609 0.011387
C  -1.258313 -0.158633 0.01132
C  0.000009 -0.942658 0.019316
C  5.979199 0.452091 0.004285
C  -5.979207 0.451977 0.00398
C  5.2018 1.602443 -0.007535
C  -5.201829 1.602343 -0.007851
H  2.479072 -1.885352 0.028862
H  -2.479036 -1.8854 0.028699
H  5.328668 -1.720216 0.027394
H  -5.328637 -1.720319 0.027014
H  1.193365 0.935831 0.000287
H  -1.193383 0.935808 0.000234
H  7.066353 0.411815 0.004545
H  -7.06636 0.41168 0.004203
H  5.425854 2.665675 -0.018818
H  -5.425903 2.665571 -0.019152
