program: Gaussian 09
title: 000150138
version: EM64L-G09RevD.01
frameworkgroup: C1[X(C10H8N2O2)]
method: RPBEPBE
basis: SDD
operation: Freq
keyword: #p
keyword: freq=noraman
keyword: PBEPBE/SDD
title: #p freq=noraman PBEPBE/SDD
converged: NO YES NO NO
title: Mulliken charges:
elementType: O O N N C C C C C C C C C C H H H H H H H H
charge: -0.333336 -0.368168 -0.016773 -0.322802 0.259964 0.240891 -0.057897 -0.359141 -0.331070 -0.301260 -0.246682 -0.218775 -0.369924 0.181120 0.287235 0.247166 0.264618 0.233917 0.235490 0.245230 0.346729 0.383469
chargesum: 0.00000
title: Mulliken charges with hydrogens summed into heavy atoms:
elementType: O O N N C C C C C C C C C C
charge: -0.333336 0.015302 -0.016773 0.023927 0.259964 0.240891 -0.057897 -0.071906 -0.083904 -0.036642 -0.012766 0.016716 -0.124695 0.181120
polarizability: 1.87033240e+02 -1.35716234e+01 1.55813771e+02 -1.93129014e-01 -1.88559141e+00 5.66385934e+01
1716.lowfreq: -7.6789 0.0004 0.0005 0.0009 3.2891 9.6228 51.9507 82.4598 125.5174
frequency: 51.9413 82.4548 125.5146 166.7344 182.5907 229.7288 273.1172 313.5048 354.8101 381.1862 427.1362 459.3281 469.0666 503.2603 523.3088 533.3390 581.0133 639.2317 650.9507 708.7079 769.0869 782.3372 797.9389 809.3858 860.3835 873.3000 891.6952 956.3457 967.2080 978.8226 1003.7253 1020.3064 1034.9871 1073.1118 1134.1258 1166.7362 1186.0022 1219.8091 1249.5841 1270.2288 1330.2616 1344.6897 1376.8154 1386.6786 1429.3421 1452.1042 1476.1078 1501.7161 1541.7331 1553.3573 1582.6032 1620.3535 3126.7823 3136.3127 3152.6767 3154.5953 3171.3589 3177.9518 3217.2174 3611.6101
redmass: 8.1659 5.0689 6.2160 5.1206 4.3451 7.9943 6.7473 4.7815 7.3270 1.9971 2.1238 3.1787 3.2249 1.7510 3.6557 2.8547 4.7739 3.7912 6.2252 3.9781 5.5512 1.4945 3.2498 5.4302 1.2856 6.5872 1.6554 2.2820 2.3429 1.3807 1.3381 2.7682 3.3355 2.6056 1.6241 1.3308 1.5509 2.0564 1.5245 1.6818 3.9442 2.1638 2.8654 2.2101 2.6938 2.6830 2.3349 3.7065 3.5383 5.6959 5.9891 6.2790 1.0890 1.0866 1.0908 1.0957 1.0954 1.0992 1.0630 1.0827
irintensity: 2.1695 2.8088 1.2844 1.4675 4.9176 12.7111 12.5740 27.7900 5.1485 44.9702 50.7774 10.2014 2.2552 103.3778 31.6888 38.4498 5.7825 6.2284 12.4998 2.0800 4.8432 78.4268 4.5070 1.2206 48.6440 9.6713 2.9688 37.7447 30.4030 4.0036 0.4682 6.2275 74.7118 1.5055 12.1804 3.8990 5.3587 3.6298 9.7404 8.0077 6.6136 199.6762 2.6077 9.6330 9.9717 13.1278 101.5262 42.9937 27.6895 7.2603 12.9614 1.1902 16.2798 6.3362 12.0359 15.1247 3.9315 21.7002 29.2142 74.5729
temp: 298.150 k
press: 1.00000 atm
elementType: 8 8 7 7 6 6 6 6 6 6 6 6 6 6 1 1 1 1 1 1 1 1
symmnumber: 1
zpe: 424951.3 jmol-1
zpe.correction: 0.161855 hartree
zpe.thermalcorrener: 0.173140 hartree
zpe.thermalcorrenthalpy: 0.174084 hartree
zpe.thermalcorrgfe: 0.124337 hartree
zpe.sumelectzpe: -644.797267 hartree
zpe.sumelectthermal: -644.785982 hartree
zpe.sumelectthermalent: -644.785038 hartree
zpe.sumelectthermalfe: -644.834785 hartree
dipole: 0.0648 0.7512 -1.4576
dipole: 1.6411
quadrupole: -80.6025 -74.4175 -84.2854
quadrupole: -12.0141 1.4651 0.8747
quadrupole: -0.8341 5.3510 -4.5169 -12.0141 1.4651 0.8747
hfenergy: -644.9591222 hartree
pointgroup: C01 [X(C10H8N2O2)]
dipole: -0.074759 0.2167702 0.6035559 debye
dipolederiv: -0.6482657 0.1749772 0.063477 -0.0297483 -0.6688657 -0.3322043 -0.1241909 -0.1941589 -0.5979831 -0.8943336 0.0351602 -0.1168943 0.302664 -0.2312639 0.1607262 0.0687216 0.0646095 -0.2725487 -0.3307241 -0.0037371 -0.004768 0.1138719 -0.2477022 0.0085448 0.0080265 -0.000822 -0.2419709 0.0631855 -0.2542164 -0.078042 -0.5134269 -0.3326665 -0.1477234 -0.2329848 -0.0194138 -0.3710955 -0.3043755 -0.1143004 -0.0281933 0.3205689 0.0174288 0.0038214 0.0471359 -0.0033617 0.0478053 0.0815069 0.1533513 0.0428521 0.1410791 0.1343029 -0.040939 0.0678177 -0.0190755 -0.0095422 0.2459701 0.3479365 0.035702 -0.0622693 0.0309474 -0.007605 -0.0233292 -0.0073932 0.0591072 -0.0340091 -0.0948691 -0.0140181 -0.0764344 -0.0472984 0.0014144 -0.0482897 0.0243064 -0.1274687 -0.080202 0.1548177 -0.0301608 -0.0219235 -0.2978633 -0.0131208 -0.0877711 -0.034272 -0.1069333 0.0653231 -0.1138317 -0.0145742 -0.1206292 -0.0635986 0.0106277 -0.0067744 0.0100866 -0.147742 -0.1024583 -0.0412309 -0.0069161 -0.0461849 0.1881231 0.0377995 0.0070351 0.0473389 -0.1399396 0.1873627 0.0750849 0.0052096 0.0400706 -0.0671777 0.0077783 0.0034608 0.0073939 -0.1422184 0.0840027 -0.2038042 -0.015752 -0.0635466 0.3964849 0.0373588 0.0107505 0.0392305 -0.0556334 0.8806628 -0.0057616 0.2319431 -0.0143185 0.6589358 0.4895244 0.3387614 0.3659246 0.6507352 0.0943067 0.0794014 0.0141888 0.0469489 0.0667677 -0.000291 -0.0031812 -0.0194666 0.1545464 -0.0547256 -0.0913529 0.0010302 -0.0641392 0.0671524 -0.0031943 0.0012474 -0.0077422 0.1460498 -0.006664 0.0380213 0.0045106 0.0955566 0.0517554 -0.0116684 0.0092579 -0.0109466 0.1584387 0.0812241 -0.0155917 -0.0001459 -0.0310752 -0.1127253 -0.0291263 -0.0025318 -0.0320602 0.1531848 -0.0903208 -0.0858781 -0.0083847 -0.0918818 0.0529011 -0.0108846 -0.0103412 -0.0117333 0.1573148 0.0684866 -0.0215745 -0.001605 -0.0165317 -0.1280942 -0.0204876 0.0027088 -0.0229396 0.1271137 0.2435836 0.0799632 -0.0117962 0.1322201 0.2599051 -0.0516725 0.0256933 -0.0703506 0.2868171 0.450464 -0.0925651 -0.0676625 -0.0408707 0.272551 -0.0886781 -0.0512227 -0.1051541 0.271963 unknown
polarizability: 185.4886727|13.2051398|154.309266|10.3797984|15.7894158|59.687666 unknown
InChI: InChI=1S/C10H8N2O2/c13-10(12-14)8-5-6-11-9-4-2-1-3-7(8)9/h1-6,12,14H
charge 0 multiplicity 1
22 atoms
O  2.277172 -1.409044 -0.716786
O  4.287715 -0.57384 0.757064
N  -1.722559 1.873445 0.219528
N  3.033045 0.119087 0.790907
C  -0.548308 -0.324351 -0.014437
C  0.719106 0.364088 0.068819
C  -1.749577 0.488839 0.077426
C  -0.68564 -1.743715 -0.166127
C  0.72169 1.762402 0.194774
C  -3.034114 -0.139917 0.021713
C  -1.954318 -2.326325 -0.216332
C  -3.136124 -1.524482 -0.120912
C  -0.517502 2.469722 0.267958
C  2.0165 -0.378068 0.004895
H  0.214822 -2.35491 -0.269192
H  1.659023 2.328209 0.197255
H  -3.913175 0.507222 0.09482
H  -2.047945 -3.411066 -0.336774
H  -4.12043 -2.003129 -0.163425
H  -0.518765 3.561862 0.362962
H  2.986218 0.796823 1.549719
H  4.085365 -1.294152 0.071145
