program: Gaussian 09
title: 000013451
version: EM64L-G09RevD.01
frameworkgroup: C1[X(C13H18N2O)]
method: RPBEPBE
basis: SDD
operation: Freq
keyword: #p
keyword: freq=noraman
keyword: PBEPBE/SDD
title: #p freq=noraman PBEPBE/SDD
converged: YES YES NO NO
title: Mulliken charges:
elementType: O N N C C C C C C C C C C C C C H H H H H H H H H H H H H H H H H H
charge: -0.298238 -0.454489 -0.497453 -0.021877 -0.455739 -0.420996 -0.407853 -0.402061 -0.376483 0.278590 0.475504 -0.452885 -0.346295 -0.198447 -0.214382 -0.262263 0.256143 0.216215 0.203594 0.192974 0.246415 0.174424 0.210166 0.205578 0.196841 0.194714 0.201804 0.281426 0.283763 0.211639 0.308211 0.222408 0.223148 0.225902
chargesum: 0.00000
title: Mulliken charges with hydrogens summed into heavy atoms:
elementType: O N N C C C C C C C C C C C C C
charge: -0.298238 -0.173063 -0.213690 0.234267 -0.035930 0.018393 -0.023264 0.000359 0.020035 0.278590 0.475504 -0.241246 -0.038084 0.023961 0.008766 -0.036361
polarizability: 2.30790662e+02 5.35091008e-01 1.47539195e+02 -9.71112158e+00 1.28661898e+00 9.79644837e+01
1716.lowfreq: -43.1773 -15.0252 -8.3679 -0.0007 -0.0005 0.0002 14.5122 30.4278 55.1718
frequency: -19.5839 27.5698 54.6122 61.8845 84.6842 131.4257 189.7729 220.3490 225.6831 243.0909 317.9544 327.3026 340.9665 378.5808 403.4498 407.6728 461.5381 475.9775 508.3654 576.3928 582.8817 613.0540 631.0533 695.4873 706.2629 735.8064 763.0932 767.3304 795.2137 815.7761 837.3005 843.8107 858.2249 872.4570 909.8407 917.1559 963.9076 966.7885 983.2536 996.6333 1006.7444 1020.9098 1035.8878 1045.2079 1058.0373 1084.2537 1088.5510 1113.6422 1148.0729 1154.5629 1170.3378 1186.0848 1201.4994 1241.1915 1256.7702 1262.5945 1275.1866 1299.9041 1315.3672 1325.2992 1328.0933 1330.9785 1347.8183 1352.6616 1366.8448 1384.2789 1425.3144 1452.2317 1458.3433 1459.1494 1461.7246 1471.5631 1482.1683 1487.2669 1510.3251 1597.8638 1616.9273 1638.6408 2944.5232 2965.8975 2968.5878 2977.5975 2982.5642 3025.8124 3028.4652 3031.6933 3037.7569 3043.9943 3058.2492 3100.7695 3128.4675 3139.9451 3162.7742 3193.6485 3524.3443 3546.3879
redmass: 3.6745 3.9047 4.7638 3.9445 4.7609 3.9114 2.3133 3.0508 2.7169 3.7810 2.2003 1.5250 4.7794 2.5351 2.4394 2.9348 2.3960 2.3906 2.5578 1.2547 4.9806 5.6304 2.7800 1.9767 9.8714 5.7651 1.7030 1.5250 3.4106 2.8298 1.2778 2.0843 2.3990 2.4354 1.4317 1.4088 2.8716 1.3460 5.8774 1.3017 2.9687 2.5583 1.9311 1.4539 2.0559 1.7220 1.5782 1.0526 1.9719 2.0511 1.0510 1.1119 1.6991 1.3587 1.2766 1.7623 1.4775 1.7127 1.5019 1.4723 1.4126 1.3916 1.4329 1.4608 1.3755 4.5170 2.3645 1.1817 1.2564 1.2029 1.1410 1.0904 1.2221 2.1805 2.3002 6.0206 5.7326 4.4054 1.0682 1.0642 1.0625 1.0640 1.0623 1.0902 1.0926 1.0926 1.1002 1.1017 1.0984 1.0886 1.0864 1.0932 1.0998 1.0949 1.0761 1.0769
irintensity: 1.1451 0.5060 5.4519 3.8672 4.5717 1.3437 1.1837 0.4696 0.4154 13.2396 6.7838 14.1305 3.3204 4.5298 4.4642 0.0277 2.4052 1.3074 58.7232 95.3971 5.3474 2.3680 0.7617 49.3012 9.2146 1.2264 90.7484 2.4696 2.3234 0.0485 0.1554 7.6658 7.6494 3.7139 13.3312 11.7064 5.9502 0.1099 2.4699 3.1998 8.7855 7.9469 4.5226 2.9577 2.2134 1.3583 11.6312 1.6564 11.5225 3.5925 0.7678 5.5303 198.5090 58.3819 20.6248 43.9375 13.9542 6.9617 32.1596 27.0367 10.5688 4.5881 3.3367 2.0593 0.6553 72.1209 31.8637 140.3684 174.2633 164.8364 66.4437 54.7275 62.1070 3.4421 559.5347 42.9782 64.6153 162.4840 37.2160 34.3574 32.9528 20.7887 32.5839 62.8511 80.5100 21.7323 33.5196 83.8659 45.9002 20.0126 0.3796 34.7970 27.1283 9.3730 5.3777 26.6237
temp: 298.150 k
press: 1.00000 atm
elementType: 8 7 7 6 6 6 6 6 6 6 6 6 6 6 6 6 1 1 1 1 1 1 1 1 1 1 1 1 1 1 1 1 1 1
symmnumber: 1
zpe: 759726.7 jmol-1
zpe.correction: 0.289365 hartree
zpe.thermalcorrener: 0.303439 hartree
zpe.thermalcorrenthalpy: 0.304383 hartree
zpe.thermalcorrgfe: 0.247516 hartree
zpe.sumelectzpe: -689.738059 hartree
zpe.sumelectthermal: -689.723985 hartree
zpe.sumelectthermalent: -689.723041 hartree
zpe.sumelectthermalfe: -689.779907 hartree
dipole: 2.5966 3.7781 0.1308
dipole: 4.5863
quadrupole: -86.4262 -92.1740 -100.5121
quadrupole: -1.2999 -2.3458 -1.1560
quadrupole: 6.6112 0.8634 -7.4747 -1.2999 -2.3458 -1.1560
hfenergy: -690.0274236 hartree
pointgroup: C01 [X(C13H18N2O1)]
dipole: -1.0097991 -1.4877594 -0.1504743 debye
polarizability: 230.6724501|-0.1633012|147.0125883|10.4769809|5.2828253|98.6093024 unknown
InChI: InChI=1S/C13H18N2O/c16-13(14-11-7-3-1-4-8-11)15-12-9-5-2-6-10-12/h1,3-4,7-8,12,14-15H,2,5-6,9-10H2
charge 0 multiplicity 1
34 atoms
O  0.081259 1.649958 -0.218421
N  -1.348479 -0.167532 -0.518063
N  0.952424 -0.552292 -0.282345
C  -2.557784 0.684418 -0.599011
C  -3.666277 -0.050928 -1.391496
C  -3.066573 1.100718 0.809123
C  -4.27651 -1.240858 -0.606934
C  -3.662059 -0.091927 1.592571
C  -4.782394 -0.793451 0.786226
C  -0.089514 0.396707 -0.327673
C  2.339276 -0.319748 -0.073968
C  3.194659 -1.45696 -0.063641
C  2.895564 0.974132 0.12056
C  4.581382 -1.307037 0.137989
C  4.286489 1.105105 0.322309
C  5.139767 -0.022246 0.333335
H  -2.252376 1.597908 -1.141474
H  -3.269855 -0.384403 -2.370034
H  -4.470546 0.681321 -1.601456
H  -3.845047 1.880024 0.676235
H  -2.23354 1.568481 1.363982
H  -3.52454 -2.050297 -0.479569
H  -5.103058 -1.685886 -1.19338
H  -4.054219 0.25648 2.567094
H  -2.858993 -0.823117 1.820752
H  -5.628495 -0.087763 0.652236
H  -5.176028 -1.662747 1.347673
H  -1.473528 -1.180394 -0.54136
H  0.698879 -1.531926 -0.426671
H  2.771599 -2.459681 -0.213706
H  2.236616 1.843853 0.108127
H  5.224292 -2.194513 0.142336
H  4.705766 2.106856 0.471507
H  6.217145 0.096245 0.489946
