program: Gaussian 09
title: 000150114
version: EM64L-G09RevD.01
frameworkgroup: C1[X(C21H17ClO)]
method: RPBEPBE
basis: SDD
operation: Freq
keyword: #p
keyword: freq=noraman
keyword: PBEPBE/SDD
title: #p freq=noraman PBEPBE/SDD
converged: YES YES NO NO
title: Mulliken charges:
elementType: Cl O C C C C C C C C C C C C C C C C C C C C C H H H H H H H H H H H H H H H H H
charge: -0.106434 -0.266377 0.139933 0.273028 0.016333 0.147128 0.273162 0.162324 0.271207 0.432092 -0.420212 -0.514684 -0.874222 -0.506619 -0.846232 -0.402184 -0.394477 -0.458033 0.311470 -0.268777 -0.266353 -0.387409 -0.535896 0.258132 0.239010 0.278386 0.229736 0.241494 0.286505 0.283487 0.274867 0.250625 0.241758 0.240669 0.229398 0.230507 0.245809 0.222345 0.221743 0.246764
chargesum: 0.00000
title: Mulliken charges with hydrogens summed into heavy atoms:
elementType: Cl O C C C C C C C C C C C C C C C C C C C C C
charge: -0.106434 -0.266377 0.139933 0.273028 0.016333 0.147128 0.273162 0.162324 0.271207 0.432092 -0.162079 -0.275674 -0.124606 -0.220115 -0.287878 -0.151559 -0.152719 -0.217365 0.311470 -0.039379 -0.035847 -0.141601 0.154956
polarizability: 4.51425275e+02 -2.91328351e+01 2.93863164e+02 9.52621079e+00 7.60211167e-01 1.17496417e+02
1716.lowfreq: -5.2858 -3.0257 -0.0008 0.0013 0.0015 7.4229 34.8681 43.5311 49.6021
frequency: 34.8503 43.5078 49.5816 78.9676 85.8830 103.6457 137.6161 142.7666 169.3646 205.9813 223.2409 242.1719 262.6353 270.2867 286.1329 322.6664 345.7773 357.0863 370.0759 397.2996 419.9834 432.7432 440.5920 452.6971 492.4381 521.6542 530.0409 536.0262 548.1320 573.9949 590.2909 605.2824 617.6292 660.8822 674.1577 685.9793 700.7840 734.9837 764.7782 772.9296 777.0800 789.3012 817.5484 824.8275 840.9016 876.8918 887.4298 901.8856 926.0907 942.3454 957.0192 971.0366 972.5084 988.2354 1003.3001 1019.7608 1034.5586 1036.6209 1070.6425 1090.2015 1111.4844 1112.6047 1129.8359 1144.5250 1168.6025 1182.7043 1187.2931 1200.8613 1233.9228 1243.9456 1246.6650 1268.9709 1294.4544 1300.3875 1341.8704 1369.9424 1382.4738 1391.1129 1395.8701 1417.1266 1425.6650 1434.4937 1436.6543 1447.7789 1467.1017 1470.1733 1473.7801 1477.9763 1499.0316 1507.0384 1513.3395 1541.6042 1560.1355 1565.1475 1612.2265 1620.0514 1629.0103 2960.8603 2975.2325 3049.5941 3059.0691 3092.2648 3107.2297 3125.0206 3125.6630 3128.9857 3130.3057 3145.9453 3159.7989 3164.4040 3166.6550 3169.1349 3172.7377 3203.1547
redmass: 7.1677 9.5558 4.1328 5.2722 3.5124 4.3182 4.1482 5.0630 3.5663 4.8928 1.3232 3.6386 3.1432 1.4326 4.2018 4.6587 4.9995 2.9141 4.6945 2.2365 4.4555 3.5384 5.2898 2.9984 4.9568 4.1137 4.0327 4.6674 4.5310 4.8616 4.0252 3.4580 5.4167 5.9749 4.3752 4.7173 3.1521 5.2157 1.4871 3.6694 3.0328 1.5755 2.6720 3.1948 1.6773 2.1497 3.8398 1.4890 2.6325 1.3550 1.3691 2.3434 1.5909 1.3378 3.4248 3.0016 1.6182 2.5241 1.9217 4.1468 1.2865 2.1472 1.1951 1.4411 1.3560 1.2095 1.2133 2.2171 1.1682 1.6528 2.1617 1.8207 2.3985 2.2050 4.2136 4.2327 3.8376 2.6668 1.4511 3.6218 2.6041 2.6619 1.9981 1.9019 1.0514 1.4240 1.0715 1.2690 1.1645 3.2935 1.5106 5.8417 5.9433 7.6230 6.2086 6.2114 6.6715 1.0329 1.0434 1.1040 1.0922 1.0587 1.0969 1.0921 1.0960 1.0891 1.0854 1.0896 1.1050 1.0961 1.0947 1.0966 1.0988 1.0902
irintensity: 0.5222 0.7052 1.0480 1.4001 5.7483 1.0739 1.5002 2.2624 1.3683 3.8224 0.7550 3.7620 1.2629 0.8273 0.9065 2.6018 1.0213 2.4901 6.3274 2.5165 0.0783 4.3530 5.2491 1.6675 15.7265 78.5038 1.3801 45.6090 0.8406 26.9225 3.9516 3.0939 2.9130 14.2706 2.5652 10.3114 6.6610 8.7983 87.1395 2.1440 0.8124 4.0462 3.1284 12.2557 76.6034 3.3607 6.8981 24.5733 11.0484 2.6173 0.8022 6.0314 4.5974 0.0719 25.9719 70.7887 1.6348 6.4729 0.1543 21.3778 2.8949 48.5522 1.3219 5.1279 6.4471 8.3786 26.1371 149.6306 64.5145 2.9698 50.4643 25.0222 29.7657 77.8855 0.4507 0.4144 5.8798 28.4050 2.8943 22.3542 2.7080 2.7298 0.7989 3.4228 15.2635 24.2602 58.7018 4.4748 31.1338 56.6480 10.0125 52.6601 42.1205 13.9563 14.8038 86.8333 56.4573 104.8624 22.1532 46.5993 19.2793 22.8894 7.3525 4.1444 27.0291 13.3706 2.2980 11.7206 3.2351 27.5231 19.9511 11.8466 34.7909 2.9429
temp: 298.150 k
press: 1.00000 atm
elementType: 17 8 6 6 6 6 6 6 6 6 6 6 6 6 6 6 6 6 6 6 6 6 6 1 1 1 1 1 1 1 1 1 1 1 1 1 1 1 1 1
symmnumber: 1
zpe: 827550.5 jmol-1
zpe.correction: 0.315197 hartree
zpe.thermalcorrener: 0.334388 hartree
zpe.thermalcorrenthalpy: 0.335332 hartree
zpe.thermalcorrgfe: 0.267485 hartree
zpe.sumelectzpe: -1344.146733 hartree
zpe.sumelectthermal: -1344.127542 hartree
zpe.sumelectthermalent: -1344.126598 hartree
zpe.sumelectthermalfe: -1344.194445 hartree
dipole: 4.3162 1.3882 -1.2784
dipole: 4.7108
quadrupole: -114.5586 -131.5546 -146.0471
quadrupole: -12.3825 6.9684 5.3312
quadrupole: 16.1615 -0.8345 -15.3270 -12.3825 6.9684 5.3312
hfenergy: -1344.4619302 hartree
pointgroup: C01 [X(C21H17Cl1O1)]
dipole: 1.6097771 0.7367165 -0.5484687 debye
polarizability: 456.3603517|-7.1858111|288.7401056|8.4104546|-6.9232735|117.6843991 unknown
InChI: InChI=1S/C21H17ClO/c1-13-16-5-3-4-6-17(16)20(12-22)18-10-8-14-7-9-15(23-2)11-19(14)21(13)18/h3-11H,12H2,1-2H3
charge 0 multiplicity 1
40 atoms
Cl -3.68704 -3.251447 0.814288
O  4.625654 1.826858 -0.397337
C  0.093795 -0.045691 0.084904
C  -0.716822 -1.246741 -0.110096
C  -0.568521 1.199252 0.291293
C  -2.11577 -1.151651 -0.365835
C  -1.989034 1.299832 0.057055
C  1.5675 -0.206601 0.082657
C  -2.766693 0.127396 -0.305421
C  2.134834 -1.525878 0.244042
C  -0.088437 -2.54806 0.048493
C  1.262348 -2.676906 0.281305
C  0.135859 2.418161 0.874318
C  2.471413 0.863253 -0.158273
C  -2.891526 -2.372799 -0.730026
C  -2.667943 2.566691 0.144347
C  -4.180203 0.280308 -0.525898
C  3.546599 -1.691339 0.28647
C  3.868842 0.672578 -0.137714
C  -4.035379 2.683765 -0.099796
C  -4.80294 1.523126 -0.426962
C  4.424689 -0.610665 0.116743
C  6.084136 1.691455 -0.434465
H  -0.71725 -3.442037 0.054777
H  1.704351 -3.665593 0.452454
H  1.062211 2.137413 1.396131
H  0.395049 3.179453 0.112395
H  -0.519646 2.909789 1.613664
H  2.120968 1.860941 -0.42196
H  -2.284452 -3.166505 -1.180533
H  -3.760448 -2.169326 -1.366994
H  -2.097195 3.468077 0.382391
H  -4.793544 -0.596938 -0.748478
H  3.952178 -2.699684 0.430657
H  -4.523679 3.66248 -0.039496
H  -5.882067 1.61138 -0.593596
H  5.506033 -0.770212 0.149843
H  6.403071 0.97646 -1.217579
H  6.484838 1.371571 0.547078
H  6.45852 2.697035 -0.675846
