program: Gaussian 09
title: 000150095
version: EM64L-G09RevD.01
frameworkgroup: C1[X(C17H16N2O2)]
method: RPBEPBE
basis: SDD
operation: Freq
keyword: #p
keyword: freq=noraman
keyword: PBEPBE/SDD
title: #p freq=noraman PBEPBE/SDD
converged: YES YES NO NO
title: Mulliken charges:
elementType: O O N N C C C C C C C C C C C C C C C C C H H H H H H H H H H H H H H H H
charge: -0.292297 -0.239261 -0.419759 -0.053956 0.288582 0.210442 0.251041 -0.095238 -0.100734 -0.389847 -0.314537 -0.355550 -0.318173 -0.313484 -0.306516 -0.291572 -0.282077 -0.233759 -0.235419 0.305062 -0.745847 0.322344 0.254890 0.224360 0.246670 0.197826 0.264323 0.264873 0.251421 0.241248 0.226354 0.225391 0.230051 0.230266 0.252464 0.248697 0.251719
chargesum: 0.00000
title: Mulliken charges with hydrogens summed into heavy atoms:
elementType: O O N N C C C C C C C C C C C C C C C C C
charge: -0.292297 -0.239261 -0.097415 -0.053956 0.288582 0.210442 0.251041 -0.095238 -0.100734 0.089403 -0.067867 -0.157724 -0.053850 -0.048611 0.186153 -0.065219 -0.056686 -0.003708 -0.005153 0.305062 0.007032
polarizability: 2.70784796e+02 2.32816669e+01 3.02232759e+02 -1.51962559e+01 3.58201493e+00 1.04038002e+02
1716.lowfreq: -20.9446 -7.1133 -4.8408 -1.7780 0.0004 0.0006 0.0006 17.8198 23.6445
frequency: -20.7257 17.3381 23.5621 33.0205 48.7757 71.3689 100.6146 112.1552 158.9102 168.7281 211.6345 237.6762 256.0498 295.1152 302.9195 341.3795 386.6345 404.7997 416.6532 434.1829 453.0471 471.2374 508.6708 534.2657 562.5351 568.0305 580.3365 597.2824 604.3083 632.4218 641.7092 645.6935 680.4826 743.6056 758.8470 762.7246 770.6403 797.3894 824.8177 861.5587 863.8718 872.7759 896.2746 915.6977 924.4387 949.9274 958.7804 990.1241 990.9039 994.7043 1015.2844 1023.8552 1033.9748 1044.2534 1072.9151 1090.1925 1108.9085 1135.9469 1160.6077 1169.4903 1184.0249 1191.9527 1217.5683 1226.5013 1245.5111 1253.2232 1283.8809 1293.1893 1341.6086 1354.0765 1365.0864 1379.7191 1386.1233 1401.1368 1432.9015 1442.1117 1450.5597 1453.4498 1456.9777 1465.1663 1467.8312 1472.4034 1506.4385 1525.5942 1553.2274 1555.4935 1611.5082 1628.9824 1662.3600 2973.8134 3006.9042 3016.8900 3072.3895 3092.8449 3100.3941 3108.1353 3129.3123 3133.6017 3141.4155 3144.8193 3152.5432 3163.3406 3169.3988 3171.8332 3538.4305
redmass: 2.6648 1.5613 3.7235 4.4544 3.4800 4.3928 4.2705 4.4139 3.1665 5.9868 4.4409 4.7232 4.7092 2.8729 4.5964 3.1964 4.7834 3.9722 3.4635 4.9541 3.6172 2.9392 3.3295 3.4389 3.2109 2.1346 3.6877 4.1051 5.1793 2.6664 5.3771 4.0065 4.7442 3.4465 1.4407 2.1082 1.7101 2.7946 5.3833 2.8265 2.0024 2.0690 3.4796 3.1721 6.0567 1.3672 1.3605 1.3283 1.3317 1.8107 2.5939 2.2935 2.2573 1.6700 2.7401 2.3781 2.0905 1.7536 1.1868 1.3846 2.0390 1.8483 1.3028 1.4666 1.6954 1.9048 1.6345 3.2276 1.4252 1.7385 1.5446 3.0796 1.2428 3.5246 2.5918 2.5022 2.7482 1.0559 1.0559 1.2895 1.2595 1.5054 3.6720 6.3740 3.8539 6.0755 5.6614 6.4279 9.8141 1.0674 1.0385 1.0574 1.0951 1.1087 1.0942 1.0868 1.0854 1.0881 1.1023 1.0892 1.0943 1.0944 1.0993 1.0993 1.0746
irintensity: 2.5737 0.3383 1.1240 1.0632 0.7522 0.5335 0.3250 2.5876 9.0518 1.6014 20.9652 0.8297 1.2102 1.3599 0.5376 5.4469 1.0876 3.0802 8.0522 0.7442 0.9029 2.0606 0.8894 12.3590 3.3848 17.3665 10.1453 9.7667 8.7416 45.1321 19.7963 30.8037 4.1639 6.9743 67.9899 38.3312 88.5699 4.2325 0.7521 3.5492 1.3137 5.8745 13.6080 17.0042 56.0564 0.9096 1.8168 0.2349 1.8176 61.4050 61.7210 2.3782 57.9004 15.3383 0.2572 0.7515 0.1680 32.6291 1.0319 1.5618 320.6695 162.6646 22.9686 8.8933 11.5117 5.0642 0.2784 12.3110 24.1561 7.8753 12.8411 27.6682 53.7891 31.1793 26.1462 22.2676 0.6751 18.0154 20.6757 32.3349 51.2964 2.0715 292.0238 49.3028 135.7517 30.4923 29.1999 13.5069 222.8841 53.7048 1.2109 15.1182 10.2572 18.5600 7.9543 8.7123 4.7556 12.9012 9.4975 11.5029 25.0663 22.7718 33.9832 26.2830 57.6764
temp: 298.150 k
press: 1.00000 atm
elementType: 8 8 7 7 6 6 6 6 6 6 6 6 6 6 6 6 6 6 6 6 6 1 1 1 1 1 1 1 1 1 1 1 1 1 1 1 1
symmnumber: 1
zpe: 766559.4 jmol-1
zpe.correction: 0.291967 hartree
zpe.thermalcorrener: 0.309597 hartree
zpe.thermalcorrenthalpy: 0.310541 hartree
zpe.thermalcorrgfe: 0.243568 hartree
zpe.sumelectzpe: -915.892024 hartree
zpe.sumelectthermal: -915.874394 hartree
zpe.sumelectthermalent: -915.873450 hartree
zpe.sumelectthermalfe: -915.940424 hartree
dipole: 3.4307 -0.2680 -1.3631
dipole: 3.7013
quadrupole: -130.8928 -106.7549 -127.7811
quadrupole: 11.4768 -10.6451 0.8475
quadrupole: -9.0832 15.0547 -5.9715 11.4768 -10.6451 0.8475
hfenergy: -916.1839914 hartree
pointgroup: C01 [X(C17H16N2O2)]
dipole: -1.3535988 -0.0457605 -0.5350142 debye
polarizability: 265.612929|18.2141428|307.3792777|15.7462093|4.6750721|104.0633494 unknown
InChI: InChI=1S/C17H16N2O2/c1-12(20)21-11-10-18-17-13-6-2-4-8-15(13)19-16-9-5-3-7-14(16)17/h2-9,18H,10-11H2,1H3
charge 0 multiplicity 1
37 atoms
O  -3.733677 -0.081738 -0.11172
O  -5.752935 0.246019 1.0105
N  -1.006171 0.398567 -0.469224
N  3.181777 -0.251414 0.265607
C  0.360961 0.214775 -0.268432
C  1.282109 1.316103 -0.167433
C  0.887996 -1.12751 -0.184187
C  2.676403 1.017458 0.150491
C  2.314001 -1.294767 0.06362
C  -1.860508 1.4408 0.124228
C  0.926887 2.686904 -0.431042
C  0.072813 -2.306357 -0.30002
C  3.599838 2.110459 0.317327
C  2.855229 -2.627007 0.132433
C  -3.039688 0.806698 0.869645
C  1.857433 3.71531 -0.298417
C  0.630264 -3.582567 -0.226531
C  3.202723 3.427459 0.111084
C  2.040171 -3.744879 -0.017285
C  -5.112714 -0.293942 0.08464
C  -5.651953 -1.2563 -0.949244
H  -1.538718 -0.403198 -0.81183
H  -1.275439 2.034393 0.84716
H  -2.25344 2.131806 -0.64867
H  -0.075653 2.927622 -0.795035
H  -1.013054 -2.224524 -0.433736
H  4.627604 1.848068 0.586517
H  3.931854 -2.711717 0.309393
H  -3.751728 1.564326 1.241048
H  -2.700972 0.174365 1.709565
H  1.567697 4.74726 -0.524905
H  -0.010735 -4.466347 -0.316972
H  3.920918 4.246243 0.230572
H  2.468014 -4.752102 0.03593
H  -6.733433 -1.096449 -1.072744
H  -5.132244 -1.13692 -1.912547
H  -5.493431 -2.293896 -0.602189
