program: Gaussian 09
title: 000150073
version: EM64L-G09RevD.01
frameworkgroup: C1[X(C14H15N3O)]
method: RPBEPBE
basis: SDD
operation: Freq
keyword: #p
keyword: freq=noraman
keyword: PBEPBE/SDD
title: #p freq=noraman PBEPBE/SDD
converged: YES YES NO NO
title: Mulliken charges:
elementType: O N N N C C C C C C C C C C C C C C H H H H H H H H H H H H H H H
charge: -0.260125 -0.427819 -0.428886 0.003775 0.277935 0.516914 0.310744 0.477368 -0.637779 -0.368487 -0.076404 -0.368021 -0.266803 -0.383066 -0.835067 -0.793419 -0.222563 -0.257877 0.233669 0.323239 0.303589 0.267188 0.252126 0.269465 0.227840 0.232954 0.219949 0.243249 0.208735 0.251657 0.250939 0.226383 0.228600
chargesum: 0.00000
title: Mulliken charges with hydrogens summed into heavy atoms:
elementType: O N N N C C C C C C C C C C C C C C
charge: -0.260125 -0.104580 -0.125298 0.003775 0.277935 0.516914 0.310744 0.477368 -0.404111 -0.101298 -0.076404 -0.115895 0.002662 -0.155225 -0.138915 -0.082088 0.003819 -0.029277
polarizability: 2.98423163e+02 3.10610515e+00 1.54797783e+02 1.31903607e+01 1.95268186e+00 1.39322909e+02
1716.lowfreq: -8.2573 0.0002 0.0004 0.0004 2.9853 8.0988 16.7622 30.6516 33.3457
frequency: 15.4439 30.4284 33.2967 81.8353 92.0979 135.1224 168.2722 173.4857 187.6775 192.4907 205.8825 233.8521 256.9649 278.8468 321.5012 345.2830 360.6274 378.9181 440.2135 451.5161 479.3164 510.3827 513.8566 528.6667 542.5700 586.3514 593.3693 623.7960 640.8729 717.8224 738.1820 746.8998 758.0835 775.3371 793.1271 825.8402 849.5379 860.2041 865.2151 923.1852 935.1522 977.1401 978.2850 995.2338 1001.6459 1039.8327 1044.7900 1047.8472 1079.8271 1102.1948 1158.2090 1173.0132 1177.6321 1182.8381 1206.7111 1249.1355 1283.6344 1295.6009 1304.4519 1348.9284 1367.6676 1374.9088 1394.7040 1401.2502 1430.3174 1439.5477 1446.8083 1455.3289 1475.0059 1476.6225 1483.5710 1491.0243 1496.0900 1517.1714 1571.1683 1599.0821 1616.0636 1626.5346 2950.4377 2995.8919 3018.7093 3084.4109 3085.8900 3094.4093 3114.9327 3122.1567 3134.7335 3143.3012 3154.4511 3168.7153 3172.2194 3459.7708 3528.3012
redmass: 6.2578 4.3759 3.8668 1.0713 6.2674 3.8995 6.7873 1.1035 3.5298 3.9313 3.5362 4.1288 4.1933 4.5042 2.7732 4.7020 2.1789 2.0810 2.8796 2.8303 4.5433 1.4224 3.3003 5.2211 2.8468 3.3437 5.5798 7.3296 5.1708 2.8658 3.0720 5.7850 1.3633 4.4840 6.2661 4.3913 1.3556 1.3290 1.5720 3.3133 1.3643 1.4395 1.4395 1.3218 1.5674 1.5186 1.5759 2.0595 2.3603 2.1947 1.6453 1.0918 1.9975 2.1329 3.6494 1.7567 1.7221 1.7827 4.9357 2.6410 4.8520 4.3360 1.2646 1.2370 2.2777 2.2620 1.5274 1.0460 1.1396 1.3155 1.6382 1.8472 2.1617 2.1031 4.7484 5.2176 6.3774 6.0483 1.0403 1.0363 1.0969 1.0966 1.0950 1.1009 1.0909 1.0876 1.0881 1.0881 1.0930 1.1003 1.0951 1.0769 1.0771
irintensity: 1.2484 1.9281 0.4276 0.6619 1.1324 1.0259 0.0603 1.4936 1.4592 2.6152 1.7649 1.4305 1.4797 11.0085 31.3297 17.5461 30.1001 69.4113 4.4609 5.2209 4.8060 75.3946 24.2618 2.0177 12.9865 1.0304 1.6232 5.7752 5.0637 3.6047 4.1055 3.6513 79.8507 2.5032 24.7448 8.4854 18.3272 0.4689 48.2950 3.7075 1.2352 2.8020 2.2204 0.0384 5.4150 4.7178 12.4555 18.0578 75.3763 54.3297 9.0503 0.2767 151.6583 34.1616 43.9458 248.9647 20.4928 115.7458 151.0360 3.9579 4.0021 13.7207 11.2330 25.6915 16.5624 19.7670 13.0757 12.8002 8.2460 25.2388 132.8461 4.4564 55.4058 52.8449 10.1453 12.5527 357.6687 130.5878 39.1494 20.7137 23.8380 9.0377 21.4084 16.4483 18.3276 14.1794 8.4968 0.3717 28.9057 17.8166 6.0411 103.5574 27.4490
temp: 298.150 k
press: 1.00000 atm
elementType: 8 7 7 7 6 6 6 6 6 6 6 6 6 6 6 6 6 6 1 1 1 1 1 1 1 1 1 1 1 1 1 1 1
symmnumber: 1
zpe: 686235.8 jmol-1
zpe.correction: 0.261373 hartree
zpe.thermalcorrener: 0.278529 hartree
zpe.thermalcorrenthalpy: 0.279473 hartree
zpe.thermalcorrgfe: 0.214683 hartree
zpe.sumelectzpe: -780.594223 hartree
zpe.sumelectthermal: -780.577067 hartree
zpe.sumelectthermalent: -780.576123 hartree
zpe.sumelectthermalfe: -780.640913 hartree
dipole: -6.2979 -2.8013 -3.9029
dipole: 7.9211
quadrupole: -130.0624 -102.2073 -101.8125
quadrupole: -17.9606 -6.0950 -3.6018
quadrupole: -18.7017 9.1534 9.5482 -17.9606 -6.0950 -3.6018
hfenergy: -780.8555965 hartree
pointgroup: C01 [X(C14H15N3O1)]
dipole: -2.4275467 0.4137968 1.9099093 debye
polarizability: 295.9621083|11.4069502|153.1251826|-20.998863|4.5653811|143.4565643 unknown
InChI: InChI=1S/C14H15N3O/c1-10-5-3-4-6-13(10)16-15-12-7-8-14(17-18)11(2)9-12/h3-9,15-16H,1-2H3
charge 0 multiplicity 1
33 atoms
O  4.898231 -1.09448 -2.038046
N  -1.391841 -0.54677 1.102215
N  -0.314386 0.301103 1.338635
N  4.733917 -0.137182 -1.178989
C  -2.497851 -0.134446 0.312352
C  0.911467 0.163866 0.683878
C  -3.689929 -0.925156 0.334751
C  3.22515 0.974104 0.387769
C  1.965353 1.07181 1.002776
C  1.125618 -0.871028 -0.277975
C  3.42929 -0.073015 -0.57448
C  -2.418083 1.026029 -0.499357
C  2.373163 -0.977866 -0.893119
C  -4.776488 -0.511353 -0.468182
C  -3.777324 -2.177836 1.189766
C  4.33608 1.944874 0.736881
C  -3.522192 1.411668 -1.288763
C  -4.709658 0.647156 -1.276993
H  1.790407 1.860317 1.746065
H  -1.517145 -1.307961 1.771833
H  -0.464137 1.110939 1.950102
H  0.303216 -1.549795 -0.51931
H  -1.492046 1.608838 -0.523256
H  2.578842 -1.753163 -1.64017
H  -5.69381 -1.112663 -0.457435
H  -3.019862 -2.93341 0.899224
H  -3.63481 -1.961007 2.268876
H  -4.766837 -2.652845 1.086135
H  3.997729 2.678601 1.488599
H  4.684159 2.487508 -0.158964
H  5.217926 1.411613 1.132232
H  -3.448518 2.307113 -1.915842
H  -5.56803 0.943037 -1.888605
