program: Gaussian 09
title: 000150009
version: EM64L-G09RevD.01
frameworkgroup: C1[X(C19H11N)]
method: RPBEPBE
basis: SDD
operation: Freq
keyword: #pfreq=noraman
keyword: PBEPBE/SDD
title: #p freq=noraman PBEPBE/SDD
converged: YES YES NO NO
title: Mulliken charges:
elementType: N C C C C C C C C C C C C C C C C C C C H H H H H H H H H H H
charge: 0.016825 0.014586 0.102559 0.318311 0.233547 -0.504096 0.426444 0.463977 0.456287 -0.425358 -0.464995 -0.475216 -0.470710 -0.382965 -0.458837 -0.364645 -0.261378 -0.385516 -0.262593 -0.242977 0.234799 0.238623 0.243176 0.243696 0.229032 0.305412 0.237028 0.230414 0.240240 0.229196 0.235134
chargesum: 0.00000
title: Mulliken charges with hydrogens summed into heavy atoms:
elementType: N C C C C C C C C C C C C C C C C C C C
charge: 0.016825 0.014586 0.102559 0.318311 0.233547 -0.504096 0.426444 0.463977 0.456287 -0.190559 -0.226371 -0.232040 -0.227014 -0.153932 -0.153425 -0.127617 -0.030964 -0.145277 -0.033397 -0.007844
polarizability: 3.03146932e+02 1.18791876e+00 2.93893632e+02 1.13237244e-03 2.01736604e-03 7.75007586e+01
1716.lowfreq: -7.5877 -5.6885 -0.0014 -0.0002 0.0012 7.3657 65.0304 99.3656 127.8280
frequency: 65.0301 99.3655 127.8280 174.4152 228.3180 235.0311 279.0545 297.3744 331.6192 380.4748 402.1706 424.4505 435.8852 449.3029 492.7325 498.3731 530.7699 546.4261 566.5115 581.9235 602.9310 620.6840 642.4136 671.5122 707.8006 739.6787 767.7609 773.9465 790.4281 791.0669 800.7591 824.2085 867.8803 870.6180 881.3911 917.1668 944.8538 960.9464 965.5286 975.2177 977.5160 985.4582 993.3246 1013.6859 1034.9220 1066.8727 1075.7164 1084.7439 1105.9427 1157.9047 1164.1181 1175.3155 1206.6091 1236.2733 1239.6353 1266.8668 1274.1894 1308.9234 1329.7606 1331.9695 1383.1639 1397.0303 1400.5473 1418.5852 1427.2313 1436.1173 1475.4058 1479.0630 1483.4400 1496.8639 1548.5503 1579.0305 1582.4750 1604.6083 1617.7555 1628.5634 3121.7299 3125.9973 3126.7722 3128.7552 3142.4654 3147.2333 3148.2638 3153.5944 3159.2130 3167.5301 3174.0564
redmass: 4.9774 4.0235 4.8849 4.2410 4.2273 4.9832 4.4432 4.5646 5.9560 6.7405 7.0443 3.6175 3.5269 6.7751 5.0631 3.5982 3.7494 7.8593 5.2885 3.1380 3.2412 7.8202 6.5799 4.1152 6.2961 2.0036 6.0764 1.2100 3.1588 6.3077 1.7418 1.5908 1.6332 6.3742 1.6127 1.4751 5.6941 1.4682 3.0886 1.3899 8.1187 1.4773 1.4159 1.4345 2.5763 2.6667 3.0211 2.2964 1.6256 1.3579 1.4101 1.0751 1.3527 2.2639 1.6722 1.6981 2.0177 2.6199 5.3777 2.9899 2.8913 4.7128 5.9378 1.8666 2.7424 4.6456 4.4204 3.2730 3.2232 4.4666 5.7742 6.0849 7.0888 6.6361 6.4563 7.3668 1.0867 1.0878 1.0866 1.0858 1.0914 1.0964 1.0933 1.0972 1.0971 1.0950 1.0975
irintensity: 0.7737 0.0027 5.1527 1.0931 0.3565 1.5203 0.7093 0.4625 0.2668 0.9886 0.2143 0.0005 2.8436 0.7404 1.7421 3.6901 0.1811 5.8476 0.0617 0.7310 20.9874 0.3750 3.4402 1.1787 0.6975 0.0294 2.9844 103.2867 2.1354 0.6527 25.7948 0.9957 50.8278 1.7121 37.9217 8.6696 1.0249 0.0693 1.4219 1.0807 1.8521 2.8218 1.0753 2.6851 9.6665 1.8269 1.2628 5.0608 0.8389 4.4241 4.4084 1.5514 7.8641 0.4639 1.4787 1.9242 5.8955 15.9102 1.9179 10.1140 16.1064 14.3032 1.9298 0.0922 35.6862 4.9980 0.0362 3.2508 6.7484 15.5019 13.8144 7.2336 17.7047 19.4303 1.5055 3.7379 2.5786 15.5611 1.0972 3.5549 28.1628 22.3326 8.0246 44.9320 15.9794 34.3744 22.5493
temp: 298.150 k
press: 1.00000 atm
elementType: 7 6 6 6 6 6 6 6 6 6 6 6 6 6 6 6 6 6 6 6 1 1 1 1 1 1 1 1 1 1 1
symmnumber: 1
zpe: 627128.1 jmol-1
zpe.correction: 0.238860 hartree
zpe.thermalcorrener: 0.251655 hartree
zpe.thermalcorrenthalpy: 0.252599 hartree
zpe.thermalcorrgfe: 0.200029 hartree
zpe.sumelectzpe: -784.132968 hartree
zpe.sumelectthermal: -784.120174 hartree
zpe.sumelectthermalent: -784.119229 hartree
zpe.sumelectthermalfe: -784.171800 hartree
dipole: -1.7100 1.8041 0.0000
dipole: 2.4857
quadrupole: -94.3583 -100.7730 -122.1547
quadrupole: 5.2202 0.0002 0.0003
quadrupole: 11.4037 4.9890 -16.3927 5.2202 0.0002 0.0003
hfenergy: -784.3718284 hartree
pointgroup: C01 [X(C19H11N1)]
dipole: -0.6853895 -0.6975937 -0.0000068 debye
polarizability: 303.1013333|-1.3531481|293.9392311|-0.001096|0.0020374|77.5007586 unknown
InChI: InChI=1S/C19H11N/c1-2-6-16-14(5-1)15-7-3-4-12-8-9-13-10-11-20-19(16)18(13)17(12)15/h1-11H
charge 0 multiplicity 1
31 atoms
N  0.546466 2.793884 0.000005
C  -0.911469 -0.682816 -0.000001
C  -0.835926 0.755174 0.000011
C  0.285553 -1.481734 -0.000018
C  1.598744 -0.80981 -0.000015
C  0.43546 1.427302 0.000008
C  1.668619 0.625089 -0.000004
C  -2.209274 -1.314533 -0.000002
C  -2.034765 1.553936 0.000023
C  0.147492 -2.893154 -0.000046
C  -3.398042 -0.487919 0.000016
C  -3.319944 0.892128 0.000029
C  -2.296296 -2.733193 -0.000023
C  2.824405 -1.539997 -0.000024
C  2.934214 1.276611 -0.000002
C  -1.894485 2.968912 0.000027
C  -1.124385 -3.510063 -0.000045
C  -0.603865 3.530254 0.000019
C  4.065739 -0.885569 -0.000024
C  4.123523 0.534583 -0.000014
H  1.034666 -3.532559 -0.000065
H  -4.374261 -0.987409 0.000016
H  -4.22843 1.505111 0.000042
H  -3.282182 -3.212191 -0.000024
H  2.809172 -2.63382 -0.000032
H  2.937812 2.369699 0.000008
H  -2.779001 3.614533 0.000036
H  -1.19277 -4.603216 -0.000064
H  -0.469865 4.618036 0.000014
H  4.990615 -1.473032 -0.000033
H  5.092076 1.046065 -0.000018
