program: Gaussian 09
title: 000150006
version: EM64L-G09RevD.01
frameworkgroup: C1[X(C17H16F3N5O2)]
method: RPBEPBE
basis: SDD
operation: Freq
keyword: #p
keyword: freq=noraman
keyword: PBEPBE/SDD
title: #p freq=noraman PBEPBE/SDD
converged: YES YES NO NO
title: Mulliken charges:
elementType: F F F O O N N N N N C C C C C C C C C C C C C C C C C H H H H H H H H H H H H H H H H
charge: -0.168334 -0.168603 -0.167420 -0.327129 -0.209829 -0.439438 -0.077169 -0.023207 -0.444070 -0.620190 -0.484223 0.053265 0.437751 -0.088045 0.349596 -0.565556 0.045266 -0.349093 -0.368245 0.259597 0.296092 -0.376149 -0.340253 0.248206 0.261088 -0.214110 -0.674045 0.232865 0.234133 0.306706 0.220422 0.239129 0.267290 0.260375 0.259898 0.336386 0.336847 0.334532 0.229837 0.226954 0.212899 0.227846 0.228129
chargesum: 0.00000
title: Mulliken charges with hydrogens summed into heavy atoms:
elementType: F F F O O N N N N N C C C C C C C C C C C C C C C C C
charge: -0.168334 -0.168603 -0.167420 -0.327129 -0.209829 -0.132732 -0.077169 -0.023207 -0.107685 0.051189 -0.017225 0.053265 0.437751 -0.088045 0.349596 -0.345135 0.045266 -0.109964 -0.100955 0.259597 0.296092 -0.115774 -0.080355 0.248206 0.261088 0.242681 -0.005171
polarizability: 5.88239606e+02 1.92141700e+01 2.32937067e+02 -1.56782387e+00 1.01486090e-01 1.09945898e+02
1716.lowfreq: -3.4390 -0.9181 -0.0013 0.0006 0.0009 4.5976 11.8115 15.9215 24.3803
frequency: 11.5813 15.8351 24.2518 28.4323 39.0578 44.2210 59.3163 75.8643 82.0482 91.6069 127.7169 145.3302 149.6299 165.3606 181.7557 196.8031 214.7869 237.1391 244.0997 250.9314 273.9547 310.8272 319.9382 351.4380 369.0111 397.0535 407.5516 408.5848 419.6802 451.9638 484.0632 487.5948 509.7664 514.4793 523.7505 544.1879 550.1419 580.6728 583.5800 592.7750 622.4910 628.1167 633.2294 653.8467 660.9466 669.3596 706.8281 709.2822 734.8743 743.2456 759.1271 798.7140 801.9718 805.3934 830.0203 843.3359 858.6315 870.6181 909.4940 959.8063 966.6844 975.1642 987.2237 989.3148 995.7190 1013.4419 1021.0273 1027.9310 1040.3338 1059.0886 1083.7056 1114.9656 1129.1861 1140.6358 1149.9614 1163.0929 1196.9206 1206.2328 1231.3098 1242.9212 1250.1897 1275.8669 1283.3678 1313.6727 1336.0566 1351.6645 1363.9460 1375.0493 1389.4880 1401.0084 1420.4103 1456.4313 1463.7736 1473.4908 1476.7460 1480.0666 1489.5395 1495.3043 1504.9391 1511.2838 1546.9000 1566.0367 1573.1030 1603.7272 1614.6541 1624.7513 1698.4869 2890.3919 2971.7654 2995.4364 3007.1328 3064.8239 3092.3288 3106.0426 3128.1692 3148.0821 3155.0051 3169.9975 3179.2720 3535.8900 3551.6933 3569.5306 3697.1048
redmass: 5.2785 9.9955 4.8584 4.6252 6.2835 6.1428 2.9141 4.2034 5.1873 2.5892 4.0858 6.9030 6.0612 7.9117 5.3475 6.5828 4.9061 4.4126 4.2112 1.4089 6.1332 6.6826 6.8255 7.4527 4.0389 5.2267 3.4367 6.5324 4.7487 2.1139 2.0973 4.5731 2.0252 2.7736 5.3012 3.4519 6.8726 7.2759 2.1713 1.2071 1.9809 8.5200 8.2311 2.3350 5.7402 5.9198 4.8377 7.8629 5.7135 3.8252 2.8917 2.9208 1.1003 6.2244 1.4592 4.6858 1.4648 4.0540 3.9659 1.6735 4.9133 4.6393 2.8678 3.8102 1.7228 2.0451 7.2792 2.5313 2.9674 3.1821 3.7572 2.2516 1.5221 1.4700 2.6104 2.9675 1.2417 1.4766 1.2326 2.8093 1.1296 2.1349 3.2330 1.3342 2.9325 1.6843 1.9695 4.4947 5.6812 1.2791 4.1015 3.6366 1.0404 2.5095 1.0721 1.6942 1.1255 1.7340 2.1907 2.8561 4.2803 2.4658 3.8729 3.3316 3.5029 5.9756 9.1170 1.0699 1.0899 1.0358 1.0582 1.1067 1.0985 1.1025 1.0924 1.0875 1.0890 1.0960 1.0960 1.0434 1.0760 1.0769 1.1058
irintensity: 0.0278 0.2434 0.0316 1.1521 0.1581 0.1371 1.4406 1.4406 1.7028 0.2088 7.3394 0.7276 1.8539 1.0926 6.8358 8.6729 0.5294 7.4144 7.8373 4.0416 1.5078 6.7763 3.8297 11.7424 13.8790 9.7367 1.8581 14.6057 4.5941 82.4433 1.4984 9.0773 77.0897 96.4982 13.2316 30.7164 9.2143 1.6951 15.2397 44.7988 6.0009 3.3571 1.7618 59.3220 7.2640 2.0839 37.9221 15.5675 6.7921 10.8872 12.0788 100.9270 8.8757 6.8845 38.6270 9.3024 57.3624 1.5150 17.4083 85.4650 178.3826 231.8566 56.7106 95.2301 53.1256 32.0499 162.1141 170.0570 276.3932 69.1423 595.7166 42.7285 1.5600 4.9504 319.7409 93.8417 22.1281 3.3443 44.0983 348.9701 0.0910 128.9400 604.7169 28.3059 10.3113 35.7630 18.7262 35.0683 111.3164 24.7452 29.1190 75.9390 11.8767 447.9552 10.4940 41.5709 66.6294 244.4379 1137.5278 122.6461 29.3420 107.4670 31.9246 823.7881 315.8346 28.1835 266.1649 81.5305 38.3420 28.0644 30.0369 9.5601 35.0579 47.6283 20.0887 8.6347 1.5600 8.5767 2.6651 79.4321 52.0191 28.9871 59.9937
temp: 298.150 k
press: 1.00000 atm
elementType: 9 9 9 8 8 7 7 7 7 7 6 6 6 6 6 6 6 6 6 6 6 6 6 6 6 6 6 1 1 1 1 1 1 1 1 1 1 1 1 1 1 1 1
symmnumber: 1
zpe: 831426.1 jmol-1
zpe.correction: 0.316673 hartree
zpe.thermalcorrener: 0.341769 hartree
zpe.thermalcorrenthalpy: 0.342714 hartree
zpe.thermalcorrgfe: 0.257220 hartree
zpe.sumelectzpe: -1379.240328 hartree
zpe.sumelectthermal: -1379.215232 hartree
zpe.sumelectthermalent: -1379.214288 hartree
zpe.sumelectthermalfe: -1379.299781 hartree
dipole: -4.8115 5.3282 -0.1977
dipole: 7.1819
quadrupole: -179.4759 -133.2550 -160.8982
quadrupole: -6.5126 -3.2030 0.0047
quadrupole: -21.5995 24.6214 -3.0219 -6.5126 -3.2030 0.0047
hfenergy: -1379.5570012 hartree
pointgroup: C01 [X(C17H16F3N5O2)]
dipole: 1.8925743 2.0922299 -0.1571577 debye
polarizability: 588.1981132|-18.6692877|231.0242599|6.4373099|-15.2654979|111.9001969 unknown
InChI: InChI=1S/C17H16F3N5O2/c1-2-27-16(26)25-13-7-11-14(15(21)24-13)23-12(8-22-11)9-3-5-10(6-4-9)17(18,19)20/h3-7,22,25H,2,8,21H2,1H3
charge 0 multiplicity 1
43 atoms
F  -7.880569 0.552123 0.41329
F  -7.535164 -0.72924 -1.421911
F  -7.407177 -1.661362 0.636034
O  7.251507 0.201429 -0.031437
O  5.977816 -1.752601 0.311712
N  0.524082 2.284722 -0.355996
N  -0.511562 -0.296314 0.10212
N  3.13507 -0.998169 0.25294
N  5.018129 0.416033 -0.055333
N  1.291339 -2.402013 0.545091
C  -0.930118 2.173358 -0.134486
C  -1.372356 0.70204 -0.030986
C  1.41236 1.244412 -0.150525
C  0.861227 -0.055196 0.099962
C  -2.819281 0.414701 -0.035391
C  2.815628 1.400512 -0.209156
C  1.775765 -1.144154 0.297811
C  -3.79049 1.458707 -0.062696
C  -3.284102 -0.934571 -0.002035
C  3.618584 0.242108 0.00067
C  -5.604975 -0.175756 -0.035012
C  -5.167966 1.167543 -0.063765
C  -4.654314 -1.229746 -0.004386
C  -7.067284 -0.492463 -0.09169
C  6.038828 -0.527022 0.101229
C  8.489421 -0.615982 0.090141
C  9.665908 0.351895 0.006681
H  -1.464686 2.661475 -0.974775
H  -1.236204 2.710657 0.793797
H  0.89718 3.208328 -0.572786
H  3.270743 2.377436 -0.406119
H  -3.481895 2.508458 -0.074779
H  -2.538572 -1.733433 0.021634
H  -5.901943 1.979029 -0.076573
H  -4.994535 -2.269675 0.024592
H  5.358072 1.363751 -0.23074
H  0.28363 -2.543326 0.57391
H  1.952243 -3.165248 0.669316
H  8.459028 -1.161059 1.05105
H  8.499492 -1.361043 -0.726493
H  10.615689 -0.207231 0.089467
H  9.665134 0.893423 -0.954918
H  9.62612 1.091564 0.824641
