program: Gaussian 09
title: 000013438
version: EM64L-G09RevD.01
frameworkgroup: C1[X(C15H12)]
method: RPBEPBE
basis: SDD
operation: Freq
keyword: #p
keyword: freq=noraman
keyword: PBEPBE/SDD
title: #p freq=noraman PBEPBE/SDD
converged: NO YES NO NO
title: Mulliken charges:
elementType: C C C C C C C C C C C C C C C H H H H H H H H H H H H
charge: 0.236356 0.183429 0.241647 0.453343 0.352574 -0.770787 -0.391784 -0.384779 -0.361250 -0.457805 -0.854536 -0.260241 -0.264156 -0.259364 -0.250011 0.236013 0.224335 0.246695 0.222140 0.243086 0.231670 0.231675 0.241741 0.227650 0.227098 0.226731 0.228531
chargesum: 0.00000
title: Mulliken charges with hydrogens summed into heavy atoms:
elementType: C C C C C C C C C C C C C C C
charge: 0.236356 0.183429 0.241647 0.453343 0.352574 -0.534774 -0.167449 -0.138085 -0.139111 -0.214719 -0.149450 -0.032591 -0.037058 -0.032632 -0.021480
polarizability: 2.55818957e+02 4.50004902e+00 1.82436084e+02 -1.15107166e-03 6.41247471e-04 6.62075325e+01
1716.lowfreq: -11.8650 -4.7653 -0.0002 0.0002 0.0008 10.5185 88.9133 100.3685 143.2407
frequency: 88.9027 100.3668 143.2386 215.9514 243.4565 246.4178 285.6647 303.8838 401.4132 415.7601 423.9544 436.0966 494.9141 516.6589 541.3361 559.4734 613.6091 614.0487 641.2386 702.0499 738.8954 760.1136 771.8505 774.1408 811.7328 860.6494 864.8642 890.0751 919.0515 954.9170 962.7715 987.7048 991.1853 991.5393 997.1388 1040.3070 1042.2186 1051.9695 1072.4264 1105.7783 1152.2083 1176.6454 1181.8769 1223.0214 1254.0870 1263.1430 1293.3301 1317.1009 1376.8325 1396.6815 1402.5681 1405.1484 1435.8809 1444.7750 1454.1985 1472.8793 1482.5062 1498.7817 1534.9703 1578.6357 1611.8864 1621.3795 1633.6790 2971.2130 3045.2776 3085.1201 3114.9010 3120.4286 3126.3148 3131.3701 3140.4511 3148.2143 3156.4360 3163.7319 3168.1122
redmass: 3.5659 3.9286 3.4528 1.1543 4.5868 3.0824 2.8814 3.3322 6.3570 2.9999 5.6881 3.1516 5.7833 3.0204 3.9796 2.9941 2.8985 6.8658 5.6972 5.3963 2.6024 1.3617 1.4862 5.0445 1.7510 4.6023 1.3157 1.7727 1.9407 1.4153 1.4016 1.3521 1.3266 6.7847 2.0201 2.3145 2.4845 1.5979 2.0580 2.2840 1.4242 1.0700 1.0970 1.3805 2.0790 1.9535 1.8037 2.2972 2.8799 1.9661 2.0883 3.6237 2.4559 2.4381 3.1044 1.0457 1.2099 2.7461 3.7683 7.5345 5.6090 6.4481 6.6785 1.0377 1.0970 1.0983 1.0912 1.0861 1.0850 1.0883 1.0898 1.0936 1.0942 1.0993 1.0989
irintensity: 0.0548 0.7044 3.8679 0.0740 0.3906 0.9759 0.5685 0.0322 1.1689 3.2121 0.5488 4.8879 1.1811 3.6635 0.2657 0.4298 0.0015 4.1358 1.9433 0.6427 43.5786 90.7857 33.9251 0.0370 0.7547 0.2114 6.2026 7.2962 12.6408 0.1145 7.6845 0.1741 0.0243 3.8502 4.3576 10.3988 2.6241 7.9380 0.1876 2.6583 3.3261 0.7305 0.2696 3.4541 10.9631 0.5699 0.2502 0.7225 5.1689 2.4202 15.5379 4.2611 8.0431 11.6569 1.7241 14.5247 6.8411 18.3675 0.9781 0.4126 4.5344 0.6852 8.4764 38.4185 20.0357 18.2342 14.8151 8.2421 0.0079 9.2858 20.4285 9.8941 24.6342 60.5574 21.9403
temp: 298.150 k
press: 1.00000 atm
elementType: 6 6 6 6 6 6 6 6 6 6 6 6 6 6 6 1 1 1 1 1 1 1 1 1 1 1 1
symmnumber: 1
zpe: 575173.8 jmol-1
zpe.correction: 0.219072 hartree
zpe.thermalcorrener: 0.230219 hartree
zpe.thermalcorrenthalpy: 0.231163 hartree
zpe.thermalcorrgfe: 0.182458 hartree
zpe.sumelectzpe: -577.811403 hartree
zpe.sumelectthermal: -577.800256 hartree
zpe.sumelectthermalent: -577.799312 hartree
zpe.sumelectthermalfe: -577.848016 hartree
dipole: -0.3629 0.3204 0.0001
dipole: 0.4841
quadrupole: -75.4607 -74.8164 -94.8552
quadrupole: -0.7495 -0.0002 0.0001
quadrupole: 6.2501 6.8944 -13.1444 -0.7495 -0.0002 0.0001
hfenergy: -578.0304746 hartree
pointgroup: C01 [X(C15H12)]
dipole: 0.1362377 0.1331205 -0.0000215 debye
dipolederiv: 0.1580709 -0.0609159 0.0000015 -0.0197563 -0.0554905 -0.0000006 0.0000048 0.0000025 0.0239199 0.1228769 0.0259826 -0.0000008 -0.0292871 -0.0952906 0.0000007 -0.0000002 -0.0000004 -0.0192798 0.0067881 -0.1456551 -0.0000048 -0.2582952 -0.0733056 0.0000004 -0.0000047 0.0000027 -0.0065609 0.090662 0.130161 0.0000005 0.2020327 -0.0318538 0.0000011 0.0000049 0.0000037 0.0776983 0.1041881 0.2071448 -0.0000024 0.1046008 0.2751603 -0.0000036 -0.0000258 -0.0000232 -0.0318838 -0.1353607 -0.1599546 0.0000014 0.035766 0.0414124 -0.000001 -0.0000044 -0.0000001 -0.2083263 -0.0672307 0.0827582 -0.0000018 0.0327606 0.040793 0. -0.0000017 0.0000006 -0.1505073 -0.0040064 0.0957659 -0.000006 0.1138278 0.0077029 -0.0000075 -0.0000021 -0.0000071 -0.1588116 -0.0874184 -0.0456062 0.0000017 0.0082416 0.0771283 -0.0000034 -0.0000021 -0.0000033 -0.1444756 -0.0376404 -0.1008033 0.0000016 -0.147527 0.091325 -0.0000039 0.0000007 -0.0000039 -0.1823212 -0.0458704 -0.1185372 0.0000002 -0.0560583 -0.05733 0.0000033 0.0000345 0.0000317 0.0700153 -0.1013543 -0.0536633 -0.000002 -0.0380973 0.0984755 -0.0000024 0.0000018 -0.0000013 -0.1630992 0.0918851 0.0104643 -0.0000078 0.054354 -0.0487561 0.000001 -0.0000125 -0.0000004 -0.1659526 -0.0841199 0.0775347 0.0000004 0.0601115 0.0566607 -0.0000019 -0.0000005 -0.0000006 -0.1665593 0.0733335 -0.0336655 0.0000033 -0.07016 -0.0278461 -0.0000012 0.0000061 -0.0000015 -0.1669357 0.0388302 0.0901036 -0.000001 0.0414978 -0.1037426 -0.000002 0.0000005 -0.0000081 0.1442927 0.0408222 -0.1236052 0.0000019 -0.0673475 -0.0418864 0.0000014 0.0000002 0.0000009 0.1421154 0.0213334 -0.0797583 0.0000037 -0.1271945 -0.0334348 0.0000049 0.0000046 0.0000046 0.1430863 0.0765334 0.0982052 -0.0000017 0.0383334 -0.0793521 0.0000026 0. 0.0000028 0.1429738 0.0553505 0.0308125 -0.000001 0.1050496 -0.0968834 0.0000029 -0.0000021 0.0000025 0.155458 -0.0264009 -0.069542 -0.1090054 -0.0267989 0.0603612 0.0278997 -0.1238154 -0.0319226 -0.042688 -0.0263551 -0.0695657 0.1089861 -0.0268457 0.060342 -0.0278691 0.1238 0.0319504 -0.0427471 0.0209505 0.1776156 0.000026 0.0405604 -0.0848987 -0.0000252 0.0000072 -0.0000318 0.1077428 0.0354781 0.0803535 0.0000013 0.106586 -0.1000447 0.0000007 0.0000022 0.0000002 0.1599233 -0.1517754 0.0307208 0.0000067 0.021837 0.0852401 0.0000002 0.0000077 -0.0000003 0.1599444 -0.014195 -0.0999476 0.0000006 -0.1266057 -0.0535981 0.000002 -0.0000003 0.000001 0.1602298 -0.1553752 0.0235973 -0.0000023 0.0284143 0.089112 0.000001 -0.0000035 0.0000011 0.1627484 unknown
polarizability: 256.0857027|-0.7776452|182.1693381|-0.0011172|-0.0006985|66.2075325 unknown
InChI: InChI=1S/C15H12/c1-11-10-12-6-2-3-8-14(12)15-9-5-4-7-13(11)15/h2-10H,1H3
charge 0 multiplicity 1
27 atoms
C  0.562979 -0.677978 0.000002
C  -0.895551 -0.533064 0.000005
C  1.40015 0.501088 -0.00001
C  -1.458601 0.793667 -0.000007
C  0.796646 1.830652 -0.000004
C  -0.583765 1.942584 -0.000006
C  1.196351 -1.958545 0.000002
C  2.821769 0.339599 -0.000041
C  -1.793681 -1.644128 0.000014
C  -2.878077 0.961372 -0.000014
C  1.668176 3.072959 -0.000004
C  2.591334 -2.089408 -0.000018
C  3.414185 -0.929261 -0.000044
C  -3.183556 -1.459552 0.00001
C  -3.734297 -0.14587 -0.000008
H  -1.045606 2.938236 0.000002
H  0.586055 -2.866791 0.000011
H  3.45938 1.229068 -0.000067
H  -1.401564 -2.665839 0.000026
H  -3.288085 1.97855 -0.000027
H  2.325817 3.111754 0.889634
H  2.325575 3.111908 -0.889821
H  1.047451 3.984401 0.000157
H  3.04731 -3.085624 -0.000018
H  4.505234 -1.029251 -0.00007
H  -3.849044 -2.329971 0.000016
H  -4.820884 -0.006556 -0.000019
