program: Gaussian 09
title: 000044500
version: EM64L-G09RevD.01
frameworkgroup: C1[X(C19H27NO6)]
method: RPBEPBE
basis: SDD
operation: Freq
keyword: #p
keyword: freq=noraman
keyword: PBEPBE/SDD
title: #p freq=noraman PBEPBE/SDD
converged: YES YES NO NO
title: Mulliken charges:
elementType: O O O O O O N C C C C C C C C C C C C C C C C C C C H H H H H H H H H H H H H H H H H H H H H H H H H H H
charge: -0.210239 -0.240512 -0.264680 -0.292584 -0.271016 -0.270805 -0.109819 -0.372195 0.254506 0.189703 0.084679 -0.335696 -0.327024 -0.301910 0.029934 0.099240 -0.607744 0.076217 0.276234 0.164088 -0.809672 -0.670685 -0.671439 -0.518529 -0.517267 -0.533139 0.220028 0.233461 0.228430 0.189744 0.205959 0.189809 0.243920 0.228904 0.259292 0.229277 0.230910 0.292837 0.207922 0.226204 0.205663 0.206074 0.227379 0.211544 0.218469 0.262172 0.231383 0.255340 0.222571 0.229247 0.245287 0.221501 0.227027
chargesum: 0.00000
title: Mulliken charges with hydrogens summed into heavy atoms:
elementType: O O O O O O N C C C C C C C C C C C C C C C C C C C
charge: -0.210239 -0.240512 -0.264680 -0.292584 -0.271016 -0.270805 -0.109819 0.081294 0.254506 0.189703 0.084679 0.082478 0.068745 0.170914 0.029934 0.099240 -0.348452 0.076217 0.276234 0.164088 -0.056649 -0.030897 -0.026442 0.193495 0.189891 0.160677
polarizability: 3.94364223e+02 5.83770202e+00 2.59978568e+02 1.19744610e+01 -6.16404990e+00 1.50598687e+02
1716.lowfreq: -5.7086 -3.9486 0.0006 0.0009 0.0012 2.1288 13.4624 16.9742 19.0451
frequency: 12.9971 16.9293 19.0321 48.0282 51.9275 59.2702 71.0718 75.0272 76.5881 82.3837 87.2683 94.1250 97.4302 110.5553 117.1019 154.5528 156.2332 166.4931 172.8678 190.0156 191.4365 204.7913 217.4267 228.7525 251.3719 263.4496 271.6415 281.5832 291.0902 299.8846 306.0883 322.5354 333.4730 351.8989 385.1014 388.3474 406.4523 425.6215 435.3275 457.1297 489.9255 504.1423 510.6078 576.4518 605.8244 623.0518 650.4275 683.1555 705.2452 724.6784 734.7593 746.8111 769.2665 775.4813 794.0220 796.1138 807.4180 833.2062 845.7502 882.1692 903.4781 917.7609 935.7103 988.7177 1001.7315 1026.0163 1034.2556 1044.0339 1055.6018 1068.6060 1076.7334 1080.0524 1084.4526 1085.7574 1089.8454 1109.3512 1111.6256 1114.1761 1126.6041 1151.6947 1155.2330 1156.9761 1182.2818 1188.3263 1202.8032 1208.6859 1224.3801 1249.2554 1282.6064 1290.9467 1294.1879 1298.4247 1330.2946 1358.6790 1362.4238 1371.2316 1380.7379 1385.5007 1386.8350 1387.7903 1398.5674 1413.8593 1417.8962 1434.4616 1442.4292 1446.1744 1456.7609 1458.9219 1460.3134 1462.1057 1463.8102 1466.8413 1470.8205 1472.4293 1476.7474 1479.6259 1480.3266 1482.3457 1484.7961 1485.9141 1488.7309 1492.1906 1568.7471 1587.4817 1602.0170 1612.0219 2856.0080 2865.9145 2915.8093 2961.3419 2974.8224 2979.3884 2981.9843 2982.0444 2982.3923 3027.4475 3034.0552 3039.3200 3046.2146 3050.0587 3057.2587 3074.0264 3075.6162 3085.9951 3088.3170 3090.4123 3091.3170 3116.8883 3126.0708 3126.3479 3129.6998 3130.8892 3172.0388
redmass: 4.0998 4.9091 3.5097 4.1200 3.4373 3.5536 3.4207 2.9224 2.8492 2.4302 2.0490 2.0434 1.5559 2.7261 3.6965 2.2885 1.2228 1.4345 1.9707 2.4805 3.2974 1.4853 3.3656 2.2342 1.7021 1.6527 2.4686 3.9103 2.7205 4.1319 3.3236 4.5888 5.4643 5.3180 3.5573 4.7210 3.9677 5.1583 4.8814 2.9015 4.3302 7.3291 4.5974 6.7143 5.2819 4.6598 6.0691 5.4400 7.2471 8.0818 2.9956 2.9304 6.9442 3.5815 1.2579 1.1347 1.4031 1.9595 6.5647 7.7860 5.3436 2.1163 5.3870 2.2326 5.8398 4.4564 3.6920 1.4837 3.0272 1.9113 2.3208 2.5924 3.9751 2.1625 5.6414 1.2360 1.2917 1.2605 1.7264 1.3712 1.3776 1.5086 1.7382 2.0404 5.8521 2.2693 3.9868 1.4286 1.1656 1.2048 2.5895 1.4446 1.4423 4.4497 1.3503 1.3359 1.6759 1.9272 1.2694 1.3054 1.3890 1.9236 1.9143 1.2731 1.4444 1.1105 1.1704 1.0771 1.1159 1.0525 1.0543 1.0512 1.8336 1.0532 1.3111 1.0574 1.0483 1.0552 1.0464 1.0735 1.0725 1.0799 8.5980 9.0565 8.2685 8.3853 1.0719 1.0713 1.0699 1.0328 1.0390 1.0323 1.0356 1.0315 1.0355 1.0882 1.0876 1.0612 1.0970 1.1040 1.0887 1.0986 1.0979 1.1010 1.1020 1.1003 1.1003 1.0971 1.1007 1.1031 1.1073 1.1043 1.0913
irintensity: 0.2449 1.2910 0.0897 0.4416 0.5260 0.8120 1.3528 3.3572 3.1287 2.3534 8.8556 1.7723 0.9056 5.2133 1.9299 0.7855 1.0945 5.9905 0.2881 2.1734 0.5824 0.3107 2.5092 0.2664 4.0347 3.4512 3.8073 4.2541 3.5630 13.6766 8.2750 3.8158 2.8272 3.5734 7.3335 1.0836 11.1418 0.8434 3.5997 21.3060 12.0367 11.5407 1.0948 6.6784 4.6170 2.8887 1.3612 1.7954 3.9777 7.7301 8.2036 2.3700 24.3911 15.5535 7.1600 3.6045 5.9417 27.7258 24.4142 5.4772 36.6430 11.9215 12.8492 3.6369 94.0431 75.3235 376.9500 1.8391 68.6127 77.2843 21.5750 88.6633 54.5930 1.5333 174.2292 15.5457 11.2809 0.8411 6.7927 7.2025 2.3859 20.6075 23.4274 8.6926 9.5183 55.0801 483.2849 28.7504 3.7928 33.8373 46.0161 47.3777 13.5194 339.1855 25.8183 15.3733 26.5069 1.7050 20.1323 19.3511 47.5953 7.2010 40.8952 5.6506 55.3646 16.2017 12.5886 14.6570 20.8171 4.1599 3.1282 13.8008 31.2640 1.0786 47.3095 17.1755 3.1585 18.4268 18.0755 12.5754 11.5429 10.3643 110.1874 36.3386 396.7321 4.6746 43.9396 153.1628 70.3532 59.1320 29.6058 79.1825 44.6147 82.5799 22.3752 8.1996 22.0858 32.6283 16.8198 44.6042 18.6493 30.3049 93.0865 30.2017 28.6021 38.2044 46.4871 1.0190 15.4108 28.7394 11.9713 17.0495 5.8755
temp: 298.150 k
press: 1.00000 atm
elementType: 8 8 8 8 8 8 7 6 6 6 6 6 6 6 6 6 6 6 6 6 6 6 6 6 6 6 1 1 1 1 1 1 1 1 1 1 1 1 1 1 1 1 1 1 1 1 1 1 1 1 1 1 1
symmnumber: 1
zpe: 1133483.4 jmol-1
zpe.correction: 0.431721 hartree
zpe.thermalcorrener: 0.461239 hartree
zpe.thermalcorrenthalpy: 0.462184 hartree
zpe.thermalcorrgfe: 0.368087 hartree
zpe.sumelectzpe: -1244.235049 hartree
zpe.sumelectthermal: -1244.205531 hartree
zpe.sumelectthermalent: -1244.204586 hartree
zpe.sumelectthermalfe: -1244.298683 hartree
dipole: 3.0460 -1.6817 1.7426
dipole: 3.8914
quadrupole: -120.7162 -142.9306 -155.1745
quadrupole: -14.4209 -5.9446 0.1534
quadrupole: 18.8909 -3.3235 -15.5674 -14.4209 -5.9446 0.1534
hfenergy: -1244.6667701 hartree
pointgroup: C01 [X(C19H27N1O6)]
dipole: 1.2343876 0.5394558 -0.7274988 debye
polarizability: 393.8687299|-12.4362454|258.5112361|-8.0338815|-16.5654376|152.5615123 unknown
InChI: InChI=1S/C19H27NO6/c1-7-20(8-2)9-10-25-19(21)15-12(3)13-11-14(22-4)17(23-5)18(24-6)16(13)26-15/h11H,7-10H2,1-6H3
charge 0 multiplicity 1
53 atoms
O  0.32166 -0.582068 0.533052
O  -2.316823 -0.267819 0.848171
O  2.2792 -2.733233 0.864268
O  4.986246 -2.106213 0.230752
O  5.713841 0.464968 -0.475596
O  -2.265787 2.001535 0.268811
N  -5.952306 -0.255682 -0.207692
C  -4.490727 -0.447074 -0.357045
C  2.020794 0.899266 -0.024204
C  0.770698 1.638748 -0.030092
C  1.699188 -0.439737 0.321769
C  -6.367485 1.158551 -0.423484
C  -6.77121 -1.240772 -0.960292
C  -3.799718 -0.174425 0.993261
C  -0.223617 0.718397 0.310387
C  2.666502 -1.462593 0.432681
C  3.365138 1.26124 -0.299236
C  4.013521 -1.093121 0.171653
C  4.3484 0.258772 -0.209489
C  -1.670039 0.90303 0.459877
C  0.613096 3.100449 -0.341614
C  -7.647635 1.535465 0.345938
C  -6.760597 -2.64169 -0.319508
C  2.583322 -3.863518 -0.045394
C  6.051469 -1.930945 1.245618
C  6.112668 1.802009 -0.920331
H  -4.277765 -1.4860 -0.66316
H  -4.054546 0.22079 -1.135236
H  -5.540565 1.807334 -0.079512
H  -6.501486 1.376508 -1.513171
H  -7.811941 -0.868863 -0.97288
H  -6.447663 -1.311137 -2.029925
H  -4.056112 -0.948502 1.731317
H  -4.064194 0.826515 1.375423
H  3.615279 2.28623 -0.582948
H  0.9842 3.32479 -1.360076
H  1.203633 3.715764 0.36395
H  -0.44205 3.404451 -0.276223
H  -7.896541 2.600501 0.180835
H  -7.503395 1.368302 1.427577
H  -8.517552 0.935341 0.022393
H  -7.394691 -3.337952 -0.899844
H  -7.144265 -2.588776 0.714209
H  -5.742178 -3.06982 -0.282784
H  2.017804 -3.748784 -0.989502
H  3.665743 -3.919788 -0.246767
H  2.236932 -4.758815 0.492052
H  6.65246 -1.034433 1.020922
H  5.606651 -1.858743 2.255712
H  6.669923 -2.838116 1.169691
H  7.196982 1.736747 -1.0922
H  5.901252 2.564499 -0.145347
H  5.600286 2.07672 -1.862468
