program: Gaussian 09
title: 000162321
version: EM64L-G09RevD.01
frameworkgroup: C1[X(C16H21NO2)]
method: RPBEPBE
basis: SDD
operation: Freq
keyword: #p
keyword: freq=noraman
keyword: PBEPBE/SDD
title: #p freq=noraman PBEPBE/SDD
converged: YES YES NO NO
title: Mulliken charges:
elementType: O O N C C C C C C C C C C C C C C C C H H H H H H H H H H H H H H H H H H H H H
charge: -0.265058 -0.254627 -0.358826 0.112438 -0.159922 -0.510534 -0.484224 0.434209 -0.257695 0.183026 -0.194355 -0.399704 -0.391572 -0.646860 -0.256939 -0.252199 -0.246007 -0.224338 -0.676727 0.258060 0.233650 0.222109 0.238765 0.210247 0.222292 0.203237 0.279863 0.270160 0.243023 0.198213 0.216726 0.257195 0.224021 0.220972 0.225964 0.227413 0.228150 0.211169 0.225405 0.233280
chargesum: 0.00000
title: Mulliken charges with hydrogens summed into heavy atoms:
elementType: O O N C C C C C C C C C C C C C C C C
charge: -0.265058 -0.254627 -0.078964 0.112438 0.098139 -0.054776 -0.035212 0.434209 -0.035403 0.183026 0.008882 -0.129544 -0.148549 0.025274 -0.032919 -0.031227 -0.020044 0.231225 -0.006872
polarizability: 2.04452901e+02 2.12285800e+01 1.72094691e+02 4.83487638e+00 1.58649604e+00 1.62359305e+02
1716.lowfreq: -11.0592 -7.6973 -0.0005 0.0002 0.0006 8.7546 26.2852 35.4273 61.8811
frequency: 26.1772 35.3039 61.8711 62.8912 73.4879 99.4004 110.2339 111.0928 151.6863 164.5576 168.0962 202.4315 237.5234 245.2033 262.0881 268.4283 299.2540 311.7842 336.0259 346.9686 380.7312 405.2453 431.3316 478.1505 514.4942 529.5645 564.5847 587.9536 617.5733 659.9601 690.5645 703.6459 707.5362 722.3711 771.6071 786.3681 799.1318 817.7248 854.5304 868.2873 901.4087 906.1047 933.5239 966.0944 967.9583 975.4687 980.6430 984.2043 991.1463 995.8463 1021.6098 1034.0245 1056.7066 1072.4102 1079.7993 1108.1845 1111.6187 1115.0386 1130.5099 1135.6896 1140.6446 1169.1747 1172.5996 1186.7030 1200.7017 1208.5677 1215.1302 1248.5641 1253.3265 1291.7352 1320.0167 1322.5062 1328.9179 1345.5092 1354.1108 1376.3689 1379.4742 1399.3161 1432.7993 1437.1638 1443.8814 1454.9505 1462.0896 1463.0669 1467.9454 1473.9532 1484.4239 1486.7033 1496.6499 1587.8269 1602.3046 1611.0095 1662.4190 2890.1302 2969.0284 2982.3729 2990.4729 2994.5863 3009.0944 3013.1667 3028.1489 3067.2080 3068.8995 3082.3659 3090.9757 3093.1534 3106.1204 3119.1610 3126.3682 3127.7587 3140.5058 3156.0493 3172.8776 3506.6652
redmass: 3.3658 3.6757 3.3706 2.7554 3.8311 3.5927 2.6077 3.0756 3.7661 1.9683 1.4387 2.8295 2.4663 2.9822 2.3407 3.8792 3.0155 2.7253 3.3084 4.2072 3.4297 2.8618 3.2795 2.5961 2.6063 2.7653 4.0264 2.4204 6.2041 4.4248 3.6977 2.6166 1.6804 2.0022 2.0395 3.0298 1.1043 2.8757 1.2587 4.0410 2.8556 2.0260 1.8392 1.9630 1.4679 2.2835 1.4105 3.4084 5.6090 1.3426 2.2598 2.1700 2.6189 1.8786 1.7917 1.6479 2.0684 1.6839 2.4891 1.4710 1.9252 2.3841 1.0699 2.6128 1.1485 1.6585 1.7388 1.1372 1.3329 1.4144 1.2950 1.4030 1.4458 1.4286 1.3838 2.3316 2.8647 1.2643 1.9670 1.2287 1.2130 1.0936 1.1006 1.0407 1.0603 1.0574 2.0556 1.0752 1.0472 5.9925 9.2287 6.6406 6.5244 1.0544 1.0601 1.0839 1.0686 1.0358 1.0582 1.0925 1.0764 1.1064 1.1000 1.1007 1.0985 1.0843 1.1025 1.0845 1.0989 1.0883 1.0938 1.0982 1.0956 1.0761
irintensity: 0.6601 0.0810 0.4508 0.8636 0.5622 0.0667 0.6565 1.8561 1.3820 0.4277 2.1433 2.1143 1.8149 1.2980 3.6908 5.1055 1.7107 0.9534 14.6308 4.8067 6.2289 0.1667 2.6921 6.7149 8.4066 33.9918 22.1142 26.8521 0.1464 9.4854 11.1748 33.2882 21.4369 34.4548 29.0995 1.6007 3.1697 2.9708 0.8292 2.6465 15.9274 12.4047 3.4538 45.6776 1.4622 2.8409 0.5869 30.9616 1.4132 0.7735 47.1021 10.2249 131.4962 36.4313 12.1352 29.4922 15.7865 41.4030 178.6320 5.1625 18.6372 5.1554 0.0085 3.3716 0.9992 4.3489 53.1878 0.1846 8.4742 0.7454 6.4832 1.0741 1.8191 3.7466 0.9113 0.3567 0.1022 23.9243 8.9931 1.9154 14.6203 14.9116 10.1289 11.7782 3.1231 4.7588 23.7627 12.3709 14.3244 4.2545 106.5695 24.2932 8.4015 153.2163 39.4600 14.6465 10.0102 22.1805 22.5152 34.2949 33.8453 6.5242 20.1593 24.4723 31.5451 11.9284 40.9406 0.6282 52.2635 7.6887 18.4793 40.5543 11.4068 2.3971
temp: 298.150 k
press: 1.00000 atm
elementType: 8 8 7 6 6 6 6 6 6 6 6 6 6 6 6 6 6 6 6 1 1 1 1 1 1 1 1 1 1 1 1 1 1 1 1 1 1 1 1 1
symmnumber: 1
zpe: 880149.6 jmol-1
zpe.correction: 0.335231 hartree
zpe.thermalcorrener: 0.354406 hartree
zpe.thermalcorrenthalpy: 0.355350 hartree
zpe.thermalcorrgfe: 0.287161 hartree
zpe.sumelectzpe: -826.045678 hartree
zpe.sumelectthermal: -826.026503 hartree
zpe.sumelectthermalent: -826.025559 hartree
zpe.sumelectthermalfe: -826.093748 hartree
dipole: 0.5386 0.3071 1.2374
dipole: 1.3841
quadrupole: -101.8181 -104.8083 -114.2189
quadrupole: -2.2722 2.3619 2.1361
quadrupole: 5.1303 2.1402 -7.2705 -2.2722 2.3619 2.1361
hfenergy: -826.3809097 hartree
pointgroup: C01 [X(C16H21N1O2)]
dipole: -0.1020439 0.1811822 0.5032654 debye
polarizability: 182.4216133|-25.501019|193.1769989|-5.1397952|7.5224264|163.3082851 unknown
InChI: InChI=1S/C16H21NO2/c1-3-19-15(18)16(13-9-5-4-6-10-13)12-8-7-11-14(16)17-2/h4-7,9-11,14,17H,3,8,12H2,1-2H3
charge 0 multiplicity 1
40 atoms
O  0.399256 2.329818 0.008355
O  -0.412957 1.350639 -1.931502
N  -1.837873 -2.08003 0.207835
C  -0.443802 0.046405 0.190102
C  -1.682782 -0.745578 -0.413601
C  -0.806564 0.440341 1.645569
C  -2.028095 1.384423 1.712025
C  0.82886 -0.831472 0.096728
C  -2.966731 0.048995 -0.223733
C  -0.189678 1.279794 -0.697989
C  -3.129228 0.984956 0.749739
C  1.438506 -1.07149 -1.165402
C  1.386313 -1.45992 1.238191
C  -1.511604 -3.268552 -0.598637
C  2.570307 -1.907048 -1.279821
C  2.518301 -2.299243 1.125415
C  3.117714 -2.527529 -0.133043
C  0.784954 3.527002 -0.802085
C  1.417555 4.524623 0.162742
H  -1.495588 -0.86042 -1.500611
H  0.056394 0.905858 2.151884
H  -1.050616 -0.502558 2.171726
H  -1.712461 2.42458 1.49122
H  -2.42607 1.405361 2.746607
H  -3.795505 -0.198759 -0.90015
H  -4.093198 1.50483 0.84546
H  -2.706668 -2.161686 0.743815
H  1.026796 -0.599407 -2.065056
H  0.938579 -1.306311 2.223253
H  -2.11337 -3.361591 -1.534076
H  -1.677607 -4.177456 0.007582
H  -0.445605 -3.250737 -0.88317
H  3.023962 -2.072995 -2.26379
H  2.929267 -2.776254 2.022834
H  3.996427 -3.176733 -0.219233
H  1.484386 3.197001 -1.591532
H  -0.123116 3.922878 -1.291876
H  1.730892 5.430797 -0.387389
H  0.701609 4.824946 0.947162
H  2.306142 4.089421 0.650953
