program: Gaussian 09
title: 000162275
version: EM64L-G09RevD.01
frameworkgroup: C1[X(C15H13NO2)]
method: RPBEPBE
basis: SDD
operation: Freq
keyword: #p
keyword: freq=noraman
keyword: PBEPBE/SDD
title: #p freq=noraman PBEPBE/SDD
converged: YES YES NO NO
title: Mulliken charges:
elementType: O O N C C C C C C C C C C C C C C C H H H H H H H H H H H H H
charge: -0.294135 -0.234491 -0.052743 0.189948 0.100045 -0.367665 0.441574 -0.309050 -0.216859 -0.246047 -0.369698 -0.368965 -0.361696 0.153584 -0.233670 -0.221649 -0.229069 -0.501136 0.247678 0.273309 0.230405 0.232537 0.231895 0.228088 0.278139 0.229079 0.229848 0.230476 0.239164 0.229372 0.241731
chargesum: 0.00000
title: Mulliken charges with hydrogens summed into heavy atoms:
elementType: O O N C C C C C C C C C C C C C C C
charge: -0.294135 -0.234491 -0.052743 0.189948 0.100045 -0.119987 0.441574 -0.035741 0.013546 -0.013510 -0.137803 -0.140877 -0.083558 0.153584 -0.004591 0.008199 0.001408 0.209131
polarizability: 3.06338603e+02 2.10702534e+01 1.83901153e+02 -7.47197351e+00 1.39456201e+01 1.01054245e+02
1716.lowfreq: -8.3004 -0.0004 -0.0002 0.0003 1.9650 4.2955 22.7718 37.7191 41.1945
frequency: 22.7326 37.7010 41.1840 63.2738 93.3633 103.7392 109.3669 146.6168 167.5987 203.0025 235.8049 274.1650 300.0811 328.1813 349.0604 403.9164 422.7307 443.3972 484.9523 534.3580 543.5427 549.1837 614.3752 634.7275 658.0994 677.2029 697.9361 753.3723 762.4255 773.1259 776.6277 819.8150 840.6077 856.6627 874.8508 922.7179 929.0134 963.1174 978.8798 987.1194 988.8500 989.8525 1006.6727 1022.2089 1037.8327 1042.1265 1080.9443 1112.8151 1122.4573 1143.7994 1171.7544 1172.8865 1177.3166 1186.9470 1233.1981 1247.7549 1270.2134 1313.6762 1362.9815 1377.0457 1397.4240 1421.5203 1428.8358 1443.8310 1450.2586 1464.6929 1469.1789 1487.0113 1565.2425 1585.6281 1592.6140 1611.6029 1622.7330 1641.5895 2951.9588 3000.4584 3100.2778 3117.2611 3129.4419 3130.1597 3142.8886 3144.2596 3146.4960 3158.7774 3159.9641 3169.8234 3180.3530
redmass: 3.7777 5.5281 5.1474 4.4281 1.5169 2.3722 3.6895 3.9688 4.6718 5.2681 5.5506 2.7922 6.4714 4.7385 5.6226 2.8250 5.2249 4.2894 3.5464 4.3746 4.6135 5.4093 6.4678 6.1967 6.3376 4.6016 1.7926 3.2217 2.6052 1.6980 2.3520 6.1781 3.6243 1.2506 1.5864 7.3975 1.3700 1.3834 1.6221 1.4209 5.5549 1.3367 1.3572 2.1508 5.1977 2.5003 1.5737 1.2662 1.8813 1.4556 1.1286 1.0592 1.3411 1.8624 3.5107 1.9519 1.5697 1.4630 2.2086 4.6575 3.6061 1.2563 2.1913 2.2047 1.0503 1.0566 2.3570 2.6556 7.0965 6.2528 6.5026 6.0827 9.0011 8.6945 1.0874 1.0297 1.1042 1.0876 1.0858 1.0871 1.1044 1.0921 1.0910 1.0964 1.0962 1.0998 1.0970
irintensity: 0.4761 0.9680 2.1414 0.0292 2.4915 0.3715 1.8795 3.9420 1.0227 2.4911 2.7188 9.2569 11.0010 11.3301 6.7778 0.0502 2.6447 6.8182 8.3274 4.8329 12.9910 2.1210 0.1591 8.7828 11.4232 19.7873 52.9838 6.4836 41.2553 75.5016 10.8633 21.7350 48.0243 0.3250 3.3729 4.2829 0.3252 2.4595 22.5235 1.4220 0.7812 0.9216 2.3237 6.4403 155.2507 92.1775 13.8549 0.1068 29.9964 66.4225 24.8224 1.7821 46.6405 21.6162 276.5946 1.8358 33.1846 18.5839 3.3182 8.1324 4.6622 21.5862 2.0497 13.9187 13.6059 20.7523 33.9776 29.1673 56.7297 15.7299 6.0219 29.6714 136.5694 293.7835 44.2208 44.5063 28.3204 7.1985 3.7061 0.6900 19.5093 24.7506 12.0187 28.2976 20.3332 21.8573 12.2365
temp: 298.150 k
press: 1.00000 atm
elementType: 8 8 7 6 6 6 6 6 6 6 6 6 6 6 6 6 6 6 1 1 1 1 1 1 1 1 1 1 1 1 1
symmnumber: 1
zpe: 628962.1 jmol-1
zpe.correction: 0.239559 hartree
zpe.thermalcorrener: 0.255640 hartree
zpe.thermalcorrenthalpy: 0.256585 hartree
zpe.thermalcorrgfe: 0.193626 hartree
zpe.sumelectzpe: -783.322854 hartree
zpe.sumelectthermal: -783.306773 hartree
zpe.sumelectthermalent: -783.305828 hartree
zpe.sumelectthermalfe: -783.368787 hartree
dipole: 0.2012 -1.0761 -0.5328
dipole: 1.2175
quadrupole: -83.5765 -90.2260 -105.0053
quadrupole: -2.5938 -0.1751 4.7926
quadrupole: 9.3595 2.7099 -12.0694 -2.5938 -0.1751 4.7926
hfenergy: -783.5624129 hartree
pointgroup: C01 [X(C15H13N1O2)]
dipole: -0.0267032 0.3886056 -0.2787994 debye
polarizability: 309.8290884|4.623612|173.3207635|1.4851346|-27.2671219|108.1441493 unknown
InChI: InChI=1S/C15H13NO2/c1-18-15(17)13-9-5-6-10-14(13)16-11-12-7-3-2-4-8-12/h2-11H,1H3
charge 0 multiplicity 1
31 atoms
O  3.02123 -2.475506 0.247861
O  0.767315 -2.177072 -0.260453
N  -0.114069 0.423786 0.088895
C  1.231389 0.762561 -0.134639
C  2.262761 -0.236221 -0.122471
C  1.609925 2.134083 -0.24107
C  -2.504162 0.50632 -0.359271
C  3.622648 0.16258 -0.204396
C  2.96438 2.506874 -0.329836
C  3.98028 1.520636 -0.30901
C  -1.095572 0.776654 -0.694863
C  -3.532189 0.981982 -1.217502
C  -2.853034 -0.229351 0.807723
C  1.90206 -1.677094 -0.063359
C  -4.887974 0.737865 -0.911324
C  -4.206266 -0.472668 1.110141
C  -5.227741 0.011252 0.253828
C  2.754961 -3.929161 0.303851
H  0.82425 2.89709 -0.214322
H  4.388804 -0.617082 -0.191294
H  3.228899 3.56736 -0.410254
H  5.034163 1.809497 -0.373882
H  -0.909909 1.277932 -1.668725
H  -3.265085 1.5424 -2.122646
H  -2.044851 -0.602918 1.444457
H  -5.675922 1.108567 -1.576009
H  -4.472181 -1.043062 2.007022
H  -6.279942 -0.181639 0.491799
H  2.392214 -4.293594 -0.672594
H  3.722904 -4.38227 0.561491
H  1.995516 -4.1512 1.072551
