program: Gaussian 09
title: 000162250
version: EM64L-G09RevD.01
frameworkgroup: C1[X(C12H18O6S2)]
method: RPBEPBE
basis: SDD
operation: Freq
keyword: #p
keyword: freq=noraman
keyword: PBEPBE/SDD
title: #p freq=noraman PBEPBE/SDD
converged: YES YES NO NO
title: Mulliken charges:
elementType: S S O O O O O O C C C C C C C C C C C C H H H H H H H H H H H H H H H H H H
charge: 0.168220 0.168361 -0.271294 -0.271243 -0.261405 -0.261368 -0.209476 -0.209360 -0.012924 -0.013495 -0.727010 -0.727024 0.333802 0.333797 0.020152 0.020090 -0.770537 -0.770475 -0.710696 -0.710707 0.290364 0.290481 0.287345 0.321950 0.322037 0.287209 0.286170 0.239701 0.246964 0.246951 0.239729 0.286151 0.276369 0.250721 0.241702 0.241711 0.250716 0.276322
chargesum: 0.00000
title: Mulliken charges with hydrogens summed into heavy atoms:
elementType: S S O O O O O O C C C C C C C C C C C C
charge: 0.168220 0.168361 -0.271294 -0.271243 -0.261405 -0.261368 -0.209476 -0.209360 0.277440 0.276987 -0.117715 -0.117778 0.333802 0.333797 0.020152 0.020090 0.002297 0.002355 0.058097 0.058041
polarizability: 2.42616220e+02 -2.67697370e+01 1.65544830e+02 -1.52217125e+01 -1.69573187e+01 1.44788616e+02
1716.lowfreq: -12.1359 -0.1105 -0.0024 -0.0019 -0.0016 11.5376 26.1899 37.0921 41.1785
frequency: 26.1894 36.7273 41.1784 43.2024 54.9733 55.5471 61.6552 77.8154 101.9469 107.0301 108.2914 110.6196 114.0780 117.1556 120.3285 121.7107 145.0016 156.6312 185.5294 200.1001 209.6453 259.9508 262.6887 320.1783 338.3405 356.4511 370.8837 451.7252 456.4849 458.9055 479.4713 501.5666 504.7269 511.9989 555.4332 569.6022 575.9509 583.4009 592.8352 613.3908 624.5174 662.8432 667.8351 779.2021 804.2904 893.0485 896.6283 935.9583 953.7824 965.7192 973.9550 998.0863 999.1180 1012.0601 1012.7223 1020.9171 1044.2832 1048.4105 1048.8110 1115.8197 1116.3985 1133.3163 1172.5367 1188.1686 1196.4517 1218.4046 1241.8600 1275.7880 1280.1947 1320.4037 1323.7924 1367.9850 1374.7998 1374.9184 1381.7883 1382.4727 1430.3466 1432.1458 1446.2876 1446.3605 1452.5716 1452.6841 1454.8878 1454.9594 1459.4324 1459.4541 1632.6864 1632.9243 1648.7316 1653.2162 2992.0353 2992.1739 3005.3697 3005.5018 3011.1448 3017.7345 3022.7630 3028.2457 3087.4367 3087.5348 3102.0266 3102.1601 3110.7292 3111.1376 3121.7203 3121.9102 3141.0325 3141.1193
redmass: 6.6565 7.7444 4.8932 6.2451 4.7882 4.2883 6.9963 5.4789 4.2800 2.9179 4.6504 2.7871 1.1900 1.2433 1.0536 1.1567 5.3263 8.7760 6.1305 7.1607 8.6245 2.7471 3.8574 3.0556 3.7259 2.9920 3.1680 3.1404 8.4641 8.6274 3.8251 4.0475 3.5773 5.0349 3.2949 3.4313 4.1798 4.2114 5.5939 5.5780 4.2361 5.3821 5.4575 3.8266 2.6374 2.9269 4.9313 2.9343 2.8679 2.4620 2.4096 2.0229 1.9665 1.5855 1.5551 2.1403 3.1896 1.6399 1.6475 2.3668 2.3596 1.9437 1.1858 2.4293 3.1237 1.2347 1.3889 1.3708 1.3128 1.1989 1.4075 1.5758 1.1979 1.1984 1.2311 1.2434 1.0855 1.0917 1.0536 1.0534 1.0577 1.0579 1.0630 1.0630 1.0570 1.0564 9.4910 9.6133 10.0114 9.7855 1.0370 1.0369 1.0379 1.0379 1.0781 1.0655 1.0663 1.0788 1.0950 1.0950 1.0940 1.0941 1.1030 1.1031 1.1023 1.1023 1.1027 1.1027
irintensity: 2.1348 0.0002 0.2306 4.3557 5.1616 0.0019 0.0012 0.6528 0.0004 9.7646 0.0415 5.1953 0.1550 0.2981 0.0028 0.4577 20.3275 0.0004 0.0002 0.0002 7.9401 22.4155 0.0002 0.0001 5.1513 0.0001 8.7186 13.9207 0.0002 3.8032 0.0000 6.6647 0.0018 2.9968 0.0001 18.1097 0.0047 156.5668 0.0004 0.0008 9.9804 0.0058 22.3942 24.1109 0.0008 47.9964 0.0172 0.0073 41.9051 0.0179 201.8792 0.3066 162.0242 0.0096 14.5237 0.0030 51.4296 0.0140 36.6004 3.7117 286.5123 0.0000 185.7539 503.4926 0.0318 0.0007 7.8726 0.0001 16.7819 24.3215 0.0027 0.0001 91.2483 14.5837 155.5031 0.2509 66.5047 0.0008 8.7647 32.9624 28.7729 14.7889 21.5748 4.0441 6.6973 24.3914 11.9997 315.7587 317.7735 0.1757 0.9823 0.9883 2.3867 2.6724 0.0028 36.0942 0.0004 4.5192 9.7766 6.3352 6.0560 4.4957 0.4057 5.2138 7.4407 7.4010 8.7991 6.9940
temp: 298.150 k
press: 1.00000 atm
elementType: 16 16 8 8 8 8 8 8 6 6 6 6 6 6 6 6 6 6 6 6 1 1 1 1 1 1 1 1 1 1 1 1 1 1 1 1 1 1
symmnumber: 1
zpe: 753797.5 jmol-1
zpe.correction: 0.287106 hartree
zpe.thermalcorrener: 0.311818 hartree
zpe.thermalcorrenthalpy: 0.312762 hartree
zpe.thermalcorrgfe: 0.229918 hartree
zpe.sumelectzpe: -1714.016596 hartree
zpe.sumelectthermal: -1713.991884 hartree
zpe.sumelectthermalent: -1713.990940 hartree
zpe.sumelectthermalfe: -1714.073784 hartree
dipole: -0.0010 -0.0053 -0.0014
dipole: 0.0055
quadrupole: -119.7817 -126.9198 -138.9445
quadrupole: 3.5730 -2.3772 -5.6287
quadrupole: 8.7670 1.6289 -10.3959 3.5730 -2.3772 -5.6287
hfenergy: -1714.3037019 hartree
pointgroup: C01 [X(C12H18O6S2)]
dipole: 0.0012475 0.0017535 -0.0003659 debye
polarizability: 206.5682863|-48.6538712|198.7376051|19.2502613|11.4429894|147.6437748 unknown
InChI: InChI=1S/C12H18O6S2/c1-7(13)17-11(5-19-9(3)15)12(18-8(2)14)6-20-10(4)16/h11-12H,5-6H2,1-4H3
charge 0 multiplicity 1
38 atoms
S  -2.871586 -0.812084 -0.292671
S  2.879792 0.818668 0.266893
O  0.175015 -1.778373 -0.483697
O  -0.164847 1.787179 0.45391
O  1.430005 -2.816504 1.194041
O  -1.427039 2.820813 -1.221285
O  -3.465754 1.458149 1.147974
O  3.475332 -1.452878 -1.171596
C  -0.10101 -0.623508 0.41964
C  0.110686 0.63184 -0.448442
C  -1.50476 -0.768157 1.014165
C  1.515165 0.775165 -1.04176
C  0.980306 -2.817744 0.026395
C  -0.974126 2.824294 -0.054927
C  -3.762836 0.766553 0.147977
C  3.770578 -0.761017 -0.171276
C  1.2265 -3.857377 -1.036785
C  -1.218634 3.86473 1.007826
C  -4.83155 1.126415 -0.859891
C  4.837474 -1.121036 0.838527
H  0.632144 -0.644891 1.24956
H  -0.622111 0.652994 -1.278654
H  -1.576417 -1.704452 1.588225
H  -1.741919 0.090693 1.668273
H  1.75224 -0.084697 -1.694544
H  1.588096 1.710624 -1.617082
H  2.109279 -3.539499 -1.621943
H  1.445674 -4.828843 -0.568851
H  0.367952 -3.937481 -1.720787
H  -0.356353 3.949723 1.686585
H  -1.444667 4.834457 0.539664
H  -2.096466 3.543905 1.598746
H  -4.389611 1.84042 -1.581392
H  -5.672611 1.627718 -0.353032
H  -5.19204 0.24759 -1.418344
H  5.194874 -0.242834 1.3999
H  5.680865 -1.619246 0.332368
H  4.395658 -1.837909 1.55719
