program: Gaussian 09
title: 000162184
version: EM64L-G09RevD.01
frameworkgroup: C1[X(C13H24O3)]
method: RPBEPBE
basis: SDD
operation: Freq
keyword: #pfreq=noraman
keyword: PBEPBE/SDD
title: #p freq=noraman PBEPBE/SDD
converged: NO YES NO NO
title: Mulliken charges:
elementType: O O O C C C C C C C C C C C C C H H H H H H H H H H H H H H H H H H H H H H H H
charge: -0.288873 -0.290063 -0.445756 0.253779 0.007786 -0.512027 -0.485125 0.028852 -0.448151 -0.079536 -0.004011 -0.374840 -0.751889 -0.738762 -0.745958 -0.360617 0.188033 0.200835 0.224429 0.198830 0.232591 0.225494 0.200980 0.186711 0.228498 0.234856 0.193941 0.235292 0.216013 0.208787 0.212175 0.204312 0.215140 0.217170 0.211016 0.200989 0.256420 0.207032 0.189559 0.346087
chargesum: 0.00000
title: Mulliken charges with hydrogens summed into heavy atoms:
elementType: O O O C C C C C C C C C C C C C
charge: -0.288873 -0.290063 -0.099670 0.253779 0.195819 -0.086764 -0.053704 0.254346 -0.060460 0.148963 0.230846 0.054393 -0.114913 -0.102140 -0.077534 0.035974
polarizability: 1.61288692e+02 6.55644013e-01 1.51109183e+02 2.29245416e+00 -3.66374802e-01 1.26093787e+02
1716.lowfreq: -9.2398 -0.0006 -0.0005 0.0003 4.3566 5.4531 34.7468 57.5620 73.4698
frequency: 26.8143 57.5169 73.4376 85.4161 107.2870 116.5376 153.8480 176.7564 204.7952 209.2167 215.2295 233.1760 237.6628 249.1743 264.2216 278.4059 302.1010 315.5646 370.4903 381.7377 398.7821 407.3783 432.4469 451.0266 506.8396 548.9832 607.5720 625.9298 652.6067 716.6777 783.3039 805.5738 817.0116 851.4452 881.4066 892.7266 915.1670 921.1871 928.4034 951.8233 956.8928 965.6855 977.0857 992.8579 1002.7005 1030.7755 1037.5478 1058.3684 1064.8738 1075.2262 1086.0004 1095.1265 1105.5878 1145.3640 1158.7967 1168.0395 1179.3952 1191.2935 1215.8193 1216.3373 1230.7175 1236.5559 1253.9565 1274.9676 1276.6633 1294.2269 1302.5049 1312.6442 1323.9937 1334.6392 1335.8019 1341.7312 1348.5175 1353.6912 1360.0026 1373.2478 1385.0385 1391.3125 1415.9823 1450.1425 1455.3144 1462.6578 1465.2860 1470.3540 1472.6753 1474.2671 1476.5406 1479.1127 1483.9996 1496.3683 2926.0785 2953.0497 2954.6065 2955.2250 2964.7646 2965.5096 2971.4901 2975.1278 2981.3145 2985.2819 2989.1943 2993.0835 3010.6408 3022.0699 3038.3766 3048.8993 3055.5011 3059.6889 3063.1460 3064.9721 3066.5517 3090.8159 3094.8981 3580.8570
redmass: 4.6212 2.8281 3.4722 2.8136 3.4065 2.9728 2.8688 1.1459 3.1146 1.0862 1.2638 2.1160 2.2949 2.2474 1.2088 2.6361 2.7723 3.6894 2.5939 3.0926 4.4745 2.6760 1.9829 2.8615 2.5683 2.6985 3.2287 3.2140 4.0204 5.8587 2.3002 2.7264 2.3813 2.9348 1.8542 1.9742 1.2348 1.7288 1.7616 1.6871 2.1366 2.2597 1.9207 3.3323 2.9628 1.7770 2.8496 1.9946 1.6683 1.9210 1.6478 2.1226 2.5217 2.1142 2.5910 2.2723 1.2424 1.9302 1.8970 1.2072 1.1743 1.3453 1.4810 1.3875 1.3889 1.4640 1.2613 1.2798 1.1876 1.3977 1.4402 1.4574 1.4471 1.5633 1.5463 1.2104 1.2158 1.2152 1.5473 1.0912 1.0830 1.0796 1.0825 1.0521 1.0730 1.0586 1.0588 1.0635 1.0473 1.0527 1.0605 1.0654 1.0715 1.0762 1.0366 1.0356 1.0782 1.0378 1.0618 1.0828 1.0618 1.0895 1.0951 1.0976 1.1015 1.1023 1.0993 1.0989 1.0982 1.0991 1.0993 1.0966 1.0986 1.0667
irintensity: 1.4895 0.3345 2.6323 0.3845 0.9000 7.3510 9.3756 141.8513 0.9113 1.0389 2.7478 1.4649 9.7521 7.2086 0.1545 0.2797 0.6910 4.0268 2.4730 3.1492 3.3758 1.1840 1.8715 3.4848 2.5952 3.6204 19.3795 4.9573 5.8458 6.3674 9.0693 12.4693 8.8720 48.4478 9.0272 10.6219 3.2059 1.5281 12.5874 1.3586 26.6888 59.6602 27.4796 22.0021 54.9218 14.4956 34.4831 15.3410 16.1296 40.1237 11.5386 22.8194 6.2882 11.9372 19.3937 14.1316 4.6654 14.9952 7.1541 7.2259 30.3209 4.6465 21.3628 8.9915 0.5593 27.9463 9.9181 1.9861 2.8178 1.5320 0.5799 0.5785 0.7393 10.0791 1.3027 22.6994 9.6463 18.8923 0.9575 7.0505 5.8577 6.9015 6.1470 4.4540 10.0467 9.4432 9.5889 7.7195 5.7536 11.5867 49.3510 17.4376 80.6111 26.4097 46.2865 35.1511 15.3645 35.1351 37.7329 16.2667 24.3469 5.3548 71.4422 54.3867 15.4735 31.6698 2.4544 78.1225 80.5376 56.4202 49.9391 27.5797 21.8565 4.5614
temp: 298.150 k
press: 1.00000 atm
elementType: 8 8 8 6 6 6 6 6 6 6 6 6 6 6 6 6 1 1 1 1 1 1 1 1 1 1 1 1 1 1 1 1 1 1 1 1 1 1 1 1
symmnumber: 1
zpe: 921265.2 jmol-1
zpe.correction: 0.350891 hartree
zpe.thermalcorrener: 0.368698 hartree
zpe.thermalcorrenthalpy: 0.369642 hartree
zpe.thermalcorrgfe: 0.305864 hartree
zpe.sumelectzpe: -734.121908 hartree
zpe.sumelectthermal: -734.104102 hartree
zpe.sumelectthermalent: -734.103158 hartree
zpe.sumelectthermalfe: -734.166936 hartree
dipole: 1.0521 -2.6396 0.6911
dipole: 2.9243
quadrupole: -90.7138 -96.3697 -100.4610
quadrupole: -9.7086 3.5576 0.8291
quadrupole: 5.1344 -0.5216 -4.6128 -9.7086 3.5576 0.8291
hfenergy: -734.4727998 hartree
pointgroup: C01 [X(C13H24O3)]
dipole: -0.3743866 -1.0603439 -0.2433276 debye
polarizability: 161.4108123|-0.1719677|151.0802808|1.4841029|-0.0087151|126.0005683 unknown
InChI: InChI=1S/C13H24O3/c1-9(2)12-5-4-10(3)6-13(12)15-8-11(7-14)16-13/h9-12,14H,4-8H2,1-3H3
charge 0 multiplicity 1
40 atoms
O  -1.273438 -0.251495 0.72001
O  -0.262603 -0.287894 -1.425077
O  -4.298883 -0.524367 1.107878
C  0.05052 -0.262877 0.028344
C  0.855895 1.011869 0.376577
C  0.788991 -1.551231 0.440235
C  2.274011 0.918669 -0.248619
C  2.21303 -1.636951 -0.163301
C  3.014106 -0.362233 0.200458
C  0.102915 2.350142 0.091175
C  -2.346722 -0.363012 -0.297897
C  -1.60057 -0.885732 -1.546085
C  2.932805 -2.921998 0.295573
C  0.597951 3.458271 1.054471
C  0.19502 2.837156 -1.376414
C  -3.448444 -1.294808 0.192669
H  0.978691 0.951657 1.480573
H  0.184847 -2.427172 0.133496
H  0.849318 -1.571976 1.546684
H  2.858611 1.814703 0.035238
H  2.190475 0.921303 -1.352182
H  2.105411 -1.663457 -1.26811
H  4.016747 -0.405529 -0.269065
H  3.174242 -0.336542 1.299772
H  -0.963499 2.16036 0.32807
H  -2.776108 0.64173 -0.482199
H  -1.540936 -1.995276 -1.547001
H  -2.029982 -0.535533 -2.49765
H  3.939455 -2.998661 -0.156616
H  3.056262 -2.933403 1.396088
H  2.364188 -3.827588 0.011231
H  1.676685 3.6636 0.911451
H  0.054362 4.404909 0.875816
H  0.441701 3.1716 2.111396
H  1.226424 3.145106 -1.633097
H  -0.458091 3.71805 -1.525062
H  -0.111995 2.044848 -2.078843
H  -2.979934 -2.16759 0.692499
H  -4.044279 -1.649359 -0.678833
H  -4.871777 -1.139588 1.629346
