program: Gaussian 09
title: 000162172
version: EM64L-G09RevD.01
frameworkgroup: C1[X(C16H24N2O2)]
method: RPBEPBE
basis: SDD
operation: Freq
keyword: #p
keyword: freq=noraman
keyword: PBEPBE/SDD
title: #p freq=noraman PBEPBE/SDD
converged: NO YES NO NO
title: Mulliken charges:
elementType: O O N N C C C C C C C C C C C C C C C C H H H H H H H H H H H H H H H H H H H H H H H H
charge: -0.296282 -0.304985 -0.294324 -0.270902 0.330398 -0.417323 -0.438108 -0.460421 -0.479799 -0.368202 0.354629 0.217651 -0.489783 -0.355019 -0.380003 -0.495028 -0.682673 -0.219947 -0.216582 -0.237671 0.209585 0.259659 0.246385 0.232871 0.180661 0.216469 0.216562 0.190848 0.200115 0.267790 0.262999 0.238470 0.244434 0.300346 0.254761 0.211725 0.225435 0.201874 0.205232 0.222377 0.232013 0.227450 0.228042 0.228270
chargesum: 0.00000
title: Mulliken charges with hydrogens summed into heavy atoms:
elementType: O O N N C C C C C C C C C C C C C C C C
charge: -0.296282 -0.304985 -0.294324 -0.007903 0.330398 0.051921 0.041148 -0.063290 -0.072389 0.099703 0.354629 0.217651 -0.006878 -0.054673 -0.125242 0.144006 -0.023050 0.007503 0.011459 -0.009401
polarizability: 1.96926127e+02 -2.09624011e+01 1.88200329e+02 3.96590796e+00 -4.44527905e+00 1.74566107e+02
1716.lowfreq: -8.0092 -0.0007 -0.0007 -0.0005 7.8240 10.9679 35.0921 51.3553 52.2292
frequency: 35.0236 51.3242 52.2098 64.9150 71.6898 77.3418 88.0467 116.1599 124.3973 138.7470 168.3481 192.3189 216.5188 233.5364 255.4104 268.9794 280.9649 286.6145 296.2870 327.6598 369.7680 392.3543 409.1771 413.8592 430.6807 471.4856 486.8453 508.0256 526.9297 577.7481 612.7144 617.9488 634.2066 686.3762 707.3989 712.9841 764.6185 790.7742 801.5219 816.5511 859.1218 870.6907 886.3003 899.0738 923.0564 938.4261 946.5889 976.8915 984.8992 989.6902 998.8284 1000.4258 1014.9187 1025.5254 1030.3549 1057.0368 1065.0084 1072.3632 1075.4081 1078.7893 1090.9213 1116.6472 1131.3256 1147.3627 1156.2236 1170.1552 1173.8719 1178.4140 1182.5769 1210.1343 1231.4030 1244.5127 1254.9629 1266.0305 1283.8820 1309.2180 1315.6903 1317.5950 1325.7265 1342.7118 1350.5194 1370.2701 1371.6320 1389.6952 1391.2204 1434.7936 1437.2589 1441.8508 1443.3822 1447.3413 1456.6911 1464.9874 1467.4832 1468.9764 1476.6861 1477.7290 1479.3035 1486.9337 1497.6759 1574.5604 1587.7186 1605.9475 2846.1156 2854.6291 2926.6148 2955.8024 2987.8699 2994.8454 3001.4551 3004.1134 3014.2861 3028.0373 3029.5818 3033.9624 3035.8934 3085.9967 3088.8238 3089.1732 3095.1793 3102.8909 3124.1516 3131.3668 3144.0831 3153.6378 3165.1735 3453.6519
redmass: 3.4870 3.0940 3.4047 3.2314 3.2429 2.6797 2.6119 3.9306 4.0615 3.3212 2.8865 1.2329 1.3523 3.6926 4.1342 2.1125 4.6154 3.1782 3.5226 2.4874 1.9886 5.7718 2.6787 2.8913 4.2225 3.5073 2.3406 3.2444 2.0925 3.1728 2.6912 5.7762 4.7985 2.6605 1.7834 2.4605 2.2986 2.6436 1.3914 1.4957 1.2466 3.1305 3.3582 2.5347 3.2293 1.5375 2.7121 2.8178 1.4999 3.7018 1.8588 1.4094 1.6589 1.8844 1.7749 6.1367 2.1346 1.5581 1.6071 2.0055 2.7396 1.4430 2.0038 2.0862 1.6408 1.0553 2.1745 1.1408 1.1709 1.2272 3.3261 1.6836 1.2027 1.3405 1.7120 1.3573 1.7215 1.2674 1.3488 1.8163 1.8908 1.6893 3.8461 1.3802 1.2460 1.8911 1.2322 1.2569 1.1194 1.1543 1.0516 1.0417 1.0847 1.0714 1.1100 1.4202 1.3948 1.0942 1.0889 6.5074 6.4003 6.1639 1.0723 1.0706 1.0340 1.0601 1.0571 1.0397 1.1022 1.0643 1.0646 1.0867 1.0970 1.0858 1.0987 1.0995 1.1016 1.0996 1.0980 1.0999 1.0847 1.0885 1.0932 1.0963 1.1016 1.0751
irintensity: 0.1310 0.9632 0.1766 0.4056 0.5788 5.8503 5.7375 3.3943 1.0352 0.0262 0.8902 0.7286 2.4755 0.0789 0.1714 1.6118 2.1407 5.8911 3.1516 7.7263 1.6199 14.1614 1.3915 0.4543 2.9184 2.1812 31.4543 17.1212 50.3030 5.4750 37.2678 0.2727 7.7390 32.0558 62.7584 4.7643 30.0292 5.6552 13.9959 1.0302 0.2031 8.4209 4.6522 5.1484 2.3709 0.7019 1.7800 6.3372 0.7949 1.1455 9.6400 0.8815 12.3458 12.1126 7.8902 109.3187 13.6807 7.0894 0.8239 6.9446 8.0494 2.4546 4.0276 9.1469 14.7917 0.0329 2.7165 1.5802 5.9013 8.2328 145.9610 44.4010 6.5991 8.5471 32.3533 1.2165 7.4734 12.3373 21.7844 111.0753 22.0446 12.9326 6.3738 6.2357 24.6697 3.0701 8.5010 17.7673 12.4265 2.6754 11.3083 12.3157 7.3233 22.8014 2.8181 32.3453 53.8504 4.1563 31.0794 219.1568 2.4920 2.3698 56.1124 162.0358 93.9323 78.0372 33.1928 27.9853 66.9230 9.3139 18.4838 57.9355 26.1698 32.6840 5.0428 13.1015 14.4528 31.5358 28.2076 29.6707 1.3747 8.5000 22.2072 8.0467 27.6505 2.9939
temp: 298.150 k
press: 1.00000 atm
elementType: 8 8 7 7 6 6 6 6 6 6 6 6 6 6 6 6 6 6 6 6 1 1 1 1 1 1 1 1 1 1 1 1 1 1 1 1 1 1 1 1 1 1 1 1
symmnumber: 1
zpe: 985072.2 jmol-1
zpe.correction: 0.375194 hartree
zpe.thermalcorrener: 0.395579 hartree
zpe.thermalcorrenthalpy: 0.396523 hartree
zpe.thermalcorrgfe: 0.326080 hartree
zpe.sumelectzpe: -882.486771 hartree
zpe.sumelectthermal: -882.466386 hartree
zpe.sumelectthermalent: -882.465441 hartree
zpe.sumelectthermalfe: -882.535885 hartree
dipole: -0.3616 -2.1057 1.5146
dipole: 2.6189
quadrupole: -105.6780 -127.0972 -112.9257
quadrupole: -2.9948 -3.0683 3.8490
quadrupole: 9.5556 -11.8636 2.3080 -2.9948 -3.0683 3.8490
hfenergy: -882.8619649 hartree
pointgroup: C01 [X(C16H24N2O2)]
dipole: 0.1023311 0.8125836 0.6251993 debye
polarizability: 198.4734735|-20.5777943|186.5418832|-4.3030445|4.2876289|174.6772054 unknown
InChI: InChI=1S/C16H24N2O2/c1-3-15(19)18(14-7-5-4-6-8-14)16(13-20-2)9-11-17-12-10-16/h4-8,17H,3,9-13H2,1-2H3
charge 0 multiplicity 1
44 atoms
O  1.127684 -0.547639 2.247638
O  0.271084 -2.685808 -0.811219
N  -0.238318 -0.447113 -0.343052
N  3.414936 1.648906 -1.20645
C  1.231852 -0.065237 -0.160029
C  1.992627 -0.355926 -1.493843
C  1.349765 1.455563 0.148885
C  3.43166 0.202687 -1.509573
C  2.813887 1.945845 0.110382
C  1.82205 -0.905299 1.000062
C  -1.278062 0.539843 -0.100596
C  -0.596678 -1.768833 -0.640427
C  -2.100402 -2.078012 -0.746678
C  -1.662062 0.85659 1.225227
C  -1.911796 1.182198 -1.191618
C  1.572716 -1.376203 3.365583
C  -2.368049 -3.582712 -0.929218
C  -2.682385 1.806962 1.453549
C  -2.933621 2.130668 -0.959702
C  -3.322544 2.444141 0.363958
H  1.424559 0.134888 -2.306638
H  2.000457 -1.440822 -1.689386
H  0.919926 1.678036 1.139738
H  0.783037 2.022461 -0.611227
H  4.068666 -0.382111 -0.797307
H  3.858735 0.054109 -2.518868
H  2.820954 3.040485 0.266699
H  3.382709 1.491969 0.961603
H  2.905972 -0.688578 1.108856
H  1.691442 -1.982239 0.782612
H  4.331369 2.095391 -1.336487
H  -2.527913 -1.508773 -1.595044
H  -2.618613 -1.694227 0.152942
H  -1.138924 0.361058 2.050124
H  -1.595444 0.939643 -2.212519
H  1.381505 -2.452911 3.172523
H  0.995778 -1.052332 4.246957
H  2.656914 -1.238279 3.567123
H  -3.453214 -3.767495 -1.030726
H  -1.990626 -4.160082 -0.067916
H  -1.85484 -3.968131 -1.826077
H  -2.97644 2.051199 2.48075
H  -3.420104 2.625501 -1.807796
H  -4.113848 3.180422 0.544485
