program: Gaussian 09
title: 000162155
version: EM64L-G09RevD.01
frameworkgroup: C1[X(C8H14O5)]
method: RPBEPBE
basis: SDD
operation: Freq
keyword: #pfreq=noraman
keyword: PBEPBE/SDD
title: #p freq=noraman PBEPBE/SDD
converged: YES YES NO NO
title: Mulliken charges:
elementType: O O O O O C C C C C C C C H H H H H H H H H H H H H H
charge: -0.257630 -0.260474 -0.260500 -0.255586 -0.255619 -0.053773 -0.053747 -0.289982 -0.290002 -0.330488 -0.330432 -0.191605 -0.191597 0.243541 0.243551 0.208282 0.193332 0.208269 0.193363 0.213875 0.218822 0.213882 0.218796 0.197991 0.234870 0.198002 0.234858
chargesum: 0.00000
title: Mulliken charges with hydrogens summed into heavy atoms:
elementType: O O O O O C C C C C C C C
charge: -0.257630 -0.260474 -0.260500 -0.255586 -0.255619 0.189768 0.189803 0.111633 0.111630 0.102210 0.102246 0.241256 0.241264
polarizability: 1.25356473e+02 -3.68936297e+00 8.94396543e+01 -6.63086303e-03 1.00508773e-03 8.62457900e+01
1716.lowfreq: -4.8513 -1.9616 -0.0004 -0.0001 0.0004 18.1556 26.2606 31.2770 42.7341
frequency: 26.0259 31.2622 42.7204 54.4794 73.2448 119.7249 146.0874 196.2763 223.4226 233.8753 237.2972 315.2775 431.2279 435.8018 490.5602 654.3108 664.3567 680.0377 680.5553 790.3290 792.4041 844.6628 846.4451 906.5477 908.6305 913.6286 940.8792 942.7057 1003.8461 1008.2293 1027.2976 1030.6832 1042.3045 1050.4532 1071.5778 1110.1130 1114.7329 1132.4251 1138.4449 1161.3856 1162.5002 1170.0019 1170.4313 1221.2175 1227.5307 1275.4118 1280.8994 1310.6552 1312.6211 1319.4490 1327.7366 1358.9114 1362.7711 1375.2219 1414.8177 1449.6164 1470.2017 1477.5593 1477.8003 1486.3297 1486.3760 2916.6477 2924.7264 2931.3423 2931.7448 2975.5307 2979.1408 2995.5084 2995.9974 3005.5706 3005.6388 3063.5621 3063.6282 3114.6744 3114.6977
redmass: 6.5047 3.4482 7.7125 4.6200 4.2279 2.7163 3.3631 2.8168 3.2145 2.4056 3.0849 3.0566 4.0258 3.4774 2.5941 4.2881 4.9797 6.7551 6.7207 3.1842 3.0554 5.5315 5.6618 2.1225 1.8973 3.2136 6.6029 7.7658 6.3158 5.6104 2.3435 2.6510 2.2767 2.5768 6.0482 1.8636 1.7861 1.6020 1.5911 1.1270 1.1366 1.1863 1.2192 1.1644 1.1581 1.2306 1.2566 1.1677 1.1851 1.1942 1.2577 1.2324 1.2468 1.5631 1.6032 1.0831 1.0897 1.0853 1.0882 1.0947 1.0946 1.0567 1.0566 1.0680 1.0681 1.0995 1.0997 1.0703 1.0702 1.0757 1.0771 1.1089 1.1089 1.0986 1.0986
irintensity: 2.7984 2.6327 0.0344 10.0259 0.6658 1.1944 9.6312 2.7336 4.5163 12.2128 9.4361 0.0799 0.6091 0.5399 19.1537 13.7558 1.8371 11.7151 0.1183 48.3721 11.5650 140.3630 19.7069 3.6548 1.0231 0.0004 66.2126 9.4498 191.2583 95.7369 8.5623 13.1106 21.4475 0.5837 140.1423 23.7042 0.9141 2.6001 0.0010 0.1382 0.4619 0.5143 4.5873 0.0795 6.1387 0.5107 0.0726 7.9686 3.5705 12.1739 0.0007 2.7820 0.6985 12.3077 2.2726 15.9320 4.5870 2.0716 1.4275 0.4052 3.5859 48.2883 74.0342 40.3029 196.1456 38.3433 0.0011 10.5957 42.2605 137.6908 10.1275 30.0902 56.4708 54.7564 1.2073
temp: 298.150 k
press: 1.00000 atm
elementType: 8 8 8 8 8 6 6 6 6 6 6 6 6 1 1 1 1 1 1 1 1 1 1 1 1 1 1
symmnumber: 1
zpe: 578219.4 jmol-1
zpe.correction: 0.220232 hartree
zpe.thermalcorrener: 0.233532 hartree
zpe.thermalcorrenthalpy: 0.234477 hartree
zpe.thermalcorrgfe: 0.177092 hartree
zpe.sumelectzpe: -688.224228 hartree
zpe.sumelectthermal: -688.210928 hartree
zpe.sumelectthermalent: -688.209984 hartree
zpe.sumelectthermalfe: -688.267368 hartree
dipole: -0.0002 0.0003 0.6614
dipole: 0.6614
quadrupole: -93.1429 -74.4303 -72.0072
quadrupole: 4.8142 0.0025 -0.0067
quadrupole: -13.2828 5.4298 7.8530 4.8142 0.0025 -0.0067
hfenergy: -688.4444604 hartree
pointgroup: C01 [X(C8H14O5)]
dipole: -0.0001122 0.2602193 0.0005631 debye
polarizability: 124.9674594|0.0229091|86.2458096|5.2375357|-0.0014606|89.8286481 unknown
InChI: InChI=1S/C8H14O5/c1(7-3-10-5-12-7)9-2-8-4-11-6-13-8/h7-8H,1-6H2
charge 0 multiplicity 1
27 atoms
O  0.000187 0.1129 -0.001112
O  -2.778767 -0.455356 -1.060771
O  2.779355 -0.452567 1.059974
O  -4.769799 0.267862 -0.071503
O  4.770121 0.272982 0.071802
C  -2.3867 -0.018479 0.305737
C  2.387428 -0.015208 -0.306417
C  -1.197584 0.92446 0.208519
C  1.197094 0.926177 -0.209116
C  -3.684478 0.655372 0.862716
C  3.684669 0.660583 -0.862223
C  -4.190323 -0.780924 -0.925324
C  4.191243 -0.776809 0.924815
H  -2.104032 -0.907495 0.904441
H  2.106145 -0.904149 -0.905892
H  -1.361498 1.631871 -0.633811
H  -1.096651 1.507315 1.152275
H  1.359532 1.632945 0.634038
H  1.096078 1.509848 -1.152353
H  -3.917026 0.301977 1.884216
H  -3.629932 1.758635 0.852928
H  3.917861 0.308698 -1.884093
H  3.628989 1.763783 -0.851086
H  -4.321762 -1.775578 -0.442997
H  -4.66259 -0.735657 -1.917078
H  4.323722 -1.77106 0.441948
H  4.663116 -0.731728 1.916767
