program: Gaussian 09
title: 000162281
version: EM64L-G09RevD.01
frameworkgroup: C1[X(C18H16ClN7O6)]
method: RPBEPBE
basis: SDD
operation: Freq
keyword: #p
keyword: freq=noraman
keyword: PBEPBE/SDD
title: #p freq=noraman PBEPBE/SDD
converged: YES YES NO NO
title: Mulliken charges:
elementType: Cl O O O O O O N N N N N N N C C C C C C C C C C C C C C C C C C H H H H H H H H H H H H H H H H
charge: 0.001658 -0.297027 -0.267224 -0.221071 -0.165692 -0.206997 -0.206670 -0.401962 -0.432132 -0.119967 -0.088811 -0.001689 0.015436 0.003279 0.380095 0.352769 0.196490 -0.491773 -0.059389 -0.376187 -0.339730 -0.452215 0.174049 0.420458 0.223889 -0.236465 -0.517451 0.454491 -0.416855 -0.522890 -0.795210 -0.154900 0.328041 0.369828 0.302399 0.250329 0.251911 0.379197 0.263608 0.270727 0.315215 0.315269 0.250911 0.236286 0.237551 0.250410 0.272056 0.255954
chargesum: 0.00000
title: Mulliken charges with hydrogens summed into heavy atoms:
elementType: Cl O O O O O O N N N N N N N C C C C C C C C C C C C C C C C C C
charge: 0.001658 -0.297027 -0.267224 -0.221071 -0.165692 -0.206997 -0.206670 -0.032135 -0.052935 -0.119967 -0.088811 -0.001689 0.015436 0.003279 0.380095 0.352769 0.196490 -0.163732 -0.059389 -0.073789 0.162510 0.082120 0.174049 0.420458 0.223889 -0.236465 -0.202236 0.454491 -0.101586 0.201859 -0.016790 -0.154900
polarizability: 8.10297297e+02 -4.41968787e+00 3.48138822e+02 -3.37781827e+00 7.26695389e+00 1.46316317e+02
1716.lowfreq: -4.6744 -3.7481 -1.0419 -0.0014 0.0005 0.0011 12.6163 18.6805 22.5848
frequency: 12.5454 18.6588 22.5758 28.7001 44.4849 48.9038 55.6576 61.0190 71.3585 81.4281 87.5940 92.1519 95.4132 106.2716 114.5679 122.3667 133.0380 148.5622 162.1507 166.9167 186.6210 190.2663 194.7398 209.7106 220.4937 239.9113 253.6487 293.3723 300.3001 307.0931 314.5106 318.1141 331.0056 342.4412 357.7946 371.9535 397.2356 423.0899 455.7614 462.4886 488.0843 507.6905 517.6823 527.7194 533.7504 554.6015 571.0960 591.9324 598.9443 607.2371 621.4969 631.8462 672.2066 686.4123 696.3360 699.3781 706.1359 725.5491 751.6955 758.0718 767.8490 817.0629 820.7754 837.9676 842.8574 868.9553 888.0233 897.3154 908.4349 922.3596 928.0027 930.8317 938.8923 981.1140 1011.5706 1028.7200 1046.1767 1049.2320 1060.2406 1108.1776 1117.8739 1127.0956 1136.7118 1161.6211 1176.4518 1185.8397 1198.0379 1205.7283 1215.8745 1222.5329 1230.6925 1234.9136 1253.7949 1268.8807 1311.1201 1324.0658 1334.4925 1347.6068 1359.1604 1370.1155 1375.8821 1381.0825 1394.4866 1420.7575 1425.1022 1437.9192 1442.5586 1450.5291 1458.4103 1466.0131 1474.3602 1476.1277 1484.0053 1489.1797 1520.9484 1544.9789 1549.1241 1560.8283 1588.5190 1618.5021 1625.8505 2200.4271 2976.3887 2978.8073 2996.2141 3010.2222 3045.8608 3071.6320 3073.7480 3088.5256 3126.0083 3141.7656 3173.2864 3182.0840 3190.6132 3191.3730 3420.2924 3491.3959
redmass: 10.0788 8.0677 7.8931 7.9551 5.3127 8.4963 7.3917 12.7094 2.5571 3.3062 5.3584 2.0709 4.0382 6.7364 6.0314 6.7496 4.3831 13.2744 5.5019 5.7435 5.2272 6.6086 2.3130 2.8247 5.2846 1.9063 4.2818 4.5300 7.9945 7.0862 9.9860 7.4909 7.3169 9.6103 5.2700 3.0852 7.2961 7.8756 4.2672 8.1847 4.7086 5.3131 8.0889 7.1646 4.7431 4.9785 4.4934 3.4304 6.5318 4.3203 1.2499 6.8894 6.2525 7.4001 9.1283 6.9408 8.9023 8.0791 3.6001 3.9130 4.4034 10.8451 5.5482 3.4083 1.1791 2.5902 1.5168 7.4634 1.4922 1.3693 4.6904 1.5126 4.7349 3.7458 1.8227 2.1874 1.6490 2.1073 2.0790 4.3314 1.2596 4.6223 3.0583 1.7092 3.2893 1.7025 8.8489 1.7635 1.8211 2.7968 3.3719 1.5186 1.3461 2.2336 7.4334 1.7585 1.9525 4.3089 11.4888 1.9604 4.4774 3.0245 1.2205 3.2614 5.8589 1.4882 1.0893 1.5704 1.2221 1.0485 1.0808 1.1419 1.0808 3.4553 3.4217 4.6224 8.4486 4.0510 7.8922 5.1348 6.9579 12.4201 1.0639 1.0320 1.0382 1.0607 1.0980 1.1014 1.1048 1.0958 1.1011 1.1014 1.0916 1.0931 1.0927 1.0930 1.0772 1.0767
irintensity: 2.0881 0.2651 1.5953 1.7339 0.4624 5.4738 1.3784 0.5586 8.2018 4.0989 10.7763 0.1192 1.1525 2.4487 1.8746 2.8361 2.5154 3.1080 1.6584 3.0040 1.4263 1.4398 4.1194 1.5947 4.7485 0.4133 2.1183 5.4508 6.2300 1.4836 0.2995 3.3481 0.6418 0.8980 4.2438 1.3914 7.3892 16.3775 0.9200 5.3394 21.5659 6.5938 3.5396 11.2173 5.0385 0.7909 13.8526 9.2891 9.2306 69.0875 96.5508 16.4443 14.0233 23.9789 8.8771 10.9052 4.5039 11.4191 3.2508 8.6479 11.0348 41.3838 14.6520 2.9089 49.8555 9.6379 21.1172 76.3917 39.8843 5.3416 14.8203 34.9230 3.1958 20.5908 69.8994 5.0662 15.2060 4.2979 74.1613 45.2157 0.0913 18.6238 28.7902 49.5200 101.9331 48.9701 2236.3756 17.5275 203.0509 183.9813 146.0338 23.5472 84.0886 162.9569 610.5500 370.8341 191.9618 84.2454 120.9514 31.0085 186.7188 175.3776 45.1609 57.9889 10.3898 69.8228 43.7286 294.4166 25.2552 16.4735 16.6350 60.8884 89.1405 354.6435 17.0656 676.0869 105.2618 248.9239 159.9767 92.9559 473.1923 6.4707 53.6086 33.5281 5.0140 3.8668 13.6170 5.6009 30.6996 5.4625 4.1605 17.1830 8.2422 10.5931 16.6545 12.4596 34.1000 268.0546
temp: 298.150 k
press: 1.00000 atm
elementType: 17 8 8 8 8 8 8 7 7 7 7 7 7 7 6 6 6 6 6 6 6 6 6 6 6 6 6 6 6 6 6 6 1 1 1 1 1 1 1 1 1 1 1 1 1 1 1 1
symmnumber: 1
zpe: 880892.7 jmol-1
zpe.correction: 0.335514 hartree
zpe.thermalcorrener: 0.366643 hartree
zpe.thermalcorrenthalpy: 0.367588 hartree
zpe.thermalcorrgfe: 0.268851 hartree
zpe.sumelectzpe: -1987.670175 hartree
zpe.sumelectthermal: -1987.639046 hartree
zpe.sumelectthermalent: -1987.638102 hartree
zpe.sumelectthermalfe: -1987.736838 hartree
dipole: -8.5049 -1.3151 0.9443
dipole: 8.6576
quadrupole: -234.2702 -188.1358 -194.0536
quadrupole: -12.7793 -14.3827 -6.9712
quadrupole: -28.7837 17.3507 11.4329 -12.7793 -14.3827 -6.9712
hfenergy: -1988.0056897 hartree
pointgroup: C01 [X(C18H16Cl1N7O6)]
dipole: 3.353302 0.5963261 0.0425098 debye
polarizability: 809.8015878|-6.0300684|265.6452845|15.487796|-99.6964889|229.3055638 unknown
InChI: InChI=1S/C18H16ClN7O6/c1-10(27)22-13-8-15(21-5-3-4-20)17(32-2)9-14(13)23-24-18-12(19)6-11(25(28)29)7-16(18)26(30)31/h6-9,21-22H,3,5H2,1-2H3
charge 0 multiplicity 1
48 atoms
Cl -2.901928 2.288532 -2.82011
O  3.670559 2.218574 -1.346044
O  2.615449 -3.427868 1.820891
O  -2.396019 -2.075812 1.59527
O  -1.936419 0.022239 2.378285
O  -7.396292 -0.733389 0.586345
O  -7.681581 0.65854 -1.206387
N  5.024556 0.297749 -0.175117
N  0.876701 -2.098054 0.973086
N  -0.543615 -0.14004 -0.182206
N  -1.286908 0.785057 -0.787577
N  -2.454196 -0.782665 1.519041
N  -6.940722 0.044468 -0.342074
N  8.408583 0.995405 -1.610302
C  3.659881 0.147222 -0.172855
C  1.596376 -1.040897 0.400806
C  2.877053 1.202007 -0.802507
C  3.004189 -0.966123 0.41048
C  0.823286 0.019502 -0.221964
C  1.494591 1.13595 -0.824938
C  5.965859 -0.683699 0.371434
C  7.357849 -0.046082 0.609865
C  -2.659271 0.603666 -0.598815
C  -3.272771 -0.195417 0.430613
C  1.376227 -3.220431 1.653449
C  -3.569165 1.25068 -1.497268
C  -4.651866 -0.408378 0.515153
C  -5.482768 0.241367 -0.420768
C  -4.954996 1.08499 -1.425657
C  2.983062 3.321468 -2.031198
C  0.304344 -4.178741 2.14937
C  7.947539 0.524854 -0.615568
H  3.557654 -1.783745 0.872449
H  5.386935 1.102708 -0.698002
H  0.868207 1.902563 -1.28829
H  6.062704 -1.556723 -0.30515
H  5.590738 -1.057089 1.341789
H  -0.145924 -2.002993 0.892707
H  8.040526 -0.818079 1.009266
H  7.281967 0.752291 1.371591
H  -5.092939 -1.038299 1.29212
H  -5.630473 1.575178 -2.130424
H  3.78261 3.987911 -2.383516
H  2.31838 3.860241 -1.330706
H  2.397922 2.94133 -2.888977
H  0.169762 -4.992059 1.411834
H  -0.669776 -3.686666 2.305803
H  0.646521 -4.637647 3.089875
