program: Gaussian 09
title: 000162348
version: EM64L-G09RevD.01
frameworkgroup: C1[X(C20H24N3O)]
method: RPBEPBE
basis: SDD
operation: Freq
keyword: #p
keyword: freq=noraman
keyword: PBEPBE/SDD
title: #p freq=noraman PBEPBE/SDD
converged: YES YES NO NO
title: Mulliken charges:
elementType: O N N N C C C C C C C C C C C C C C C C C C C C H H H H H H H H H H H H H H H H H H H H H H H H
charge: -0.251874 -0.177026 0.031648 -0.283210 -0.053275 0.341023 0.390565 0.206939 -0.672438 -0.671588 -0.408736 -0.322055 -0.663442 -0.386605 -0.227927 -0.213712 -0.505813 0.424046 -0.338384 -0.396487 -0.337478 -0.340149 0.330758 -0.535327 0.243547 0.218331 0.245100 0.219706 0.243638 0.244552 0.257456 0.265667 0.261519 0.261751 0.306271 0.241453 0.252503 0.253683 0.319424 0.255084 0.254572 0.236947 0.235658 0.266347 0.256995 0.227577 0.231446 0.261319
chargesum: 1.00000
title: Mulliken charges with hydrogens summed into heavy atoms:
elementType: O N N N C C C C C C C C C C C C C C C C C C C C
charge: -0.251874 -0.177026 0.031648 0.036214 -0.053275 0.341023 0.390565 0.206939 0.034540 0.036309 -0.151281 -0.056388 0.166098 -0.145152 0.024575 0.039970 0.003843 0.424046 -0.101437 -0.160828 -0.071131 -0.083153 0.330758 0.185015
polarizability: 5.73683018e+02 -1.84275443e+01 2.01548065e+02 -3.28173751e+01 1.68263992e+00 1.74624636e+02
1716.lowfreq: -6.4297 -5.9298 -0.0009 -0.0005 0.0008 2.4065 4.9959 17.3828 22.2477
frequency: -1.6156 17.3476 22.2192 42.9328 66.1108 77.4354 100.2912 101.3787 122.7300 142.4812 154.2112 176.8209 182.6666 215.4970 218.9961 223.2015 236.1999 237.4225 253.7410 273.5450 294.5449 308.2885 313.0078 327.9639 351.5171 362.6799 381.9480 415.0807 439.6946 470.8157 474.0289 514.7809 528.8348 542.7866 553.9445 564.8926 579.5018 625.3044 631.0733 683.4674 695.5991 713.8429 725.3310 745.7992 756.1455 766.7865 769.8900 815.9402 823.4354 839.1186 874.9009 875.8028 892.8975 927.3535 933.0742 943.0872 947.2171 954.7387 967.8815 977.9283 999.1757 999.3443 1007.9196 1010.1165 1021.2769 1047.9224 1065.7618 1110.8304 1114.9196 1117.4381 1125.8134 1131.9055 1137.2848 1155.6146 1162.4194 1181.0492 1183.5459 1194.1077 1216.3022 1226.5949 1245.8057 1247.2891 1270.5392 1287.2850 1301.2615 1309.1784 1320.4403 1375.2938 1384.0906 1389.9877 1403.4616 1412.1668 1422.8121 1427.8593 1436.6151 1451.0930 1459.5395 1460.1079 1461.4024 1463.5272 1468.4979 1469.9986 1470.6950 1479.9156 1482.2550 1491.5582 1504.2831 1510.3706 1518.0338 1575.6717 1578.6105 1610.2624 1622.2918 1624.1830 2973.9312 2993.0502 2993.7038 2997.8527 3002.9692 3048.1428 3068.4084 3072.2228 3089.7606 3091.3044 3095.3880 3101.2566 3104.2065 3124.1381 3126.5560 3142.2017 3144.0834 3154.2882 3156.0301 3166.1184 3169.9643 3174.4505 3180.9184 3337.8921
redmass: 5.1255 4.4024 3.4406 4.1331 4.6245 2.6869 1.7891 1.8402 3.2212 2.9835 3.4845 3.0873 2.6550 1.2110 1.3992 3.0869 1.9011 3.1582 1.2563 3.2534 3.5258 2.8045 3.1087 2.7652 3.5138 3.8359 6.0487 2.9791 4.5706 3.6558 3.4686 3.2375 4.8144 4.5991 3.7741 3.4824 3.8371 3.8705 6.3698 1.3397 4.8096 3.6806 4.5803 4.2465 3.2193 3.6610 1.4235 2.0792 1.7847 1.7659 1.4033 1.4933 3.0358 2.1267 2.1511 1.4958 1.5131 1.3824 1.3560 8.1102 1.3705 2.6375 1.8816 1.6739 2.1957 3.4195 2.6434 1.2586 2.0812 1.3448 1.6095 1.9620 1.8260 1.3279 2.3158 1.2232 1.1409 2.2104 2.4228 1.6238 2.6952 3.9961 2.2709 2.3848 1.3452 1.5646 1.5861 2.2511 1.1668 2.6494 1.6573 2.5881 1.2971 3.7292 1.1782 2.3588 1.1937 1.5604 1.1442 1.0573 1.0717 1.0530 1.1462 1.0747 1.1279 1.0434 2.4857 1.8198 3.3752 5.2271 6.4868 7.0272 6.2131 7.7009 1.0327 1.0348 1.0351 1.0628 1.0359 1.0873 1.1047 1.1001 1.1016 1.1006 1.1000 1.1015 1.1013 1.0903 1.0902 1.1003 1.0890 1.0902 1.0997 1.0948 1.0939 1.0954 1.1004 1.0756
irintensity: 0.4856 0.2685 1.1297 0.5608 1.1676 0.2732 2.4493 3.1933 1.9585 5.4088 2.2926 0.8246 1.9147 0.5760 0.2897 2.0209 6.6395 15.6513 0.7043 12.9376 2.9885 0.7403 1.7467 5.6348 2.0712 0.0124 3.2408 0.2958 10.9829 7.0308 8.7123 44.0232 3.7239 12.4787 18.1109 1.5294 19.3307 1.8274 0.9564 63.6181 21.7476 2.4239 11.0671 1.4321 6.5802 1.6304 76.4258 26.4160 2.7776 55.8939 7.9857 31.7907 16.8632 24.1762 3.7633 1.8523 0.3598 1.4302 0.7604 63.2493 0.4314 9.8885 9.5494 8.3173 5.1180 46.7806 10.3442 0.1208 0.0403 20.5685 4.7227 0.0496 29.4388 4.0994 91.4537 141.6628 5.1938 3.3682 3.9408 20.5873 5.4186 322.1733 13.5773 0.7810 54.0327 1.0812 130.3670 152.5109 14.3364 14.5063 3.8740 4.6694 27.6645 12.9707 9.7108 35.8071 3.0267 4.8572 57.0758 8.1389 52.5625 20.5466 45.9842 13.1725 12.0677 21.1635 33.8127 376.7955 327.4856 431.4906 19.2753 17.9731 162.3160 5.9745 71.7212 11.1560 14.6074 16.3811 18.3768 15.0703 36.6013 2.7692 5.6007 1.2059 33.6595 9.0367 16.4149 11.7945 9.4083 15.2787 2.2089 0.4509 8.1130 6.3811 9.3504 2.5725 10.9855 106.1780
temp: 298.150 k
press: 1.00000 atm
elementType: 8 7 7 7 6 6 6 6 6 6 6 6 6 6 6 6 6 6 6 6 6 6 6 6 1 1 1 1 1 1 1 1 1 1 1 1 1 1 1 1 1 1 1 1 1 1 1 1
symmnumber: 1
zpe: 1045719.9 jmol-1
zpe.correction: 0.398294 hartree
zpe.thermalcorrener: 0.420934 hartree
zpe.thermalcorrenthalpy: 0.421878 hartree
zpe.thermalcorrgfe: 0.345681 hartree
zpe.sumelectzpe: -1014.012011 hartree
zpe.sumelectthermal: -1013.989370 hartree
zpe.sumelectthermalent: -1013.988426 hartree
zpe.sumelectthermalfe: -1014.064624 hartree
dipole: 3.2505 0.2924 2.4681
dipole: 4.0918
quadrupole: -25.1186 -119.9910 -134.5702
quadrupole: -4.6278 -15.6637 2.9705
quadrupole: 68.1080 -26.7644 -41.3436 -4.6278 -15.6637 2.9705
hfenergy: -1014.4103044 hartree
pointgroup: C01 [X(C20H24N3O1)]
dipole: 1.2441538 0.6092027 0.8200774 debye
polarizability: 574.5493127|-32.2554062|195.5751848|-1.0863541|-12.7142072|179.7312217 unknown
InChI: InChI=1S/C20H24N3O/c1-20(2)17-7-5-6-8-18(17)23(3)19(20)14-22-21-13-15-9-11-16(24-4)12-10-15/h5-12,14,21H,13H2,1-4H3
charge 1 multiplicity 1
48 atoms
O  -7.18466 -0.110356 -1.835892
N  2.74704 -0.747927 0.574927
N  -0.173777 -0.001031 0.854418
N  -1.423683 0.433981 0.931426
C  3.184506 1.366845 -0.418837
C  4.4590 0.532053 -0.325013
C  2.143195 0.414188 0.205473
C  4.153655 -0.714243 0.267506
C  3.29871 2.684562 0.40872
C  2.818829 1.685908 -1.90206
C  5.777101 0.811027 -0.715357
C  5.115043 -1.714872 0.492631
C  2.142791 -1.935307 1.211574
C  0.777861 0.799184 0.330845
C  6.769787 -0.17964 -0.499859
C  6.441876 -1.42351 0.095013
C  -2.503193 -0.430915 1.479095
C  -3.755559 -0.328607 0.6287
C  -3.770272 -0.837686 -0.701108
C  -4.93136 0.270215 1.1388
C  -4.923755 -0.747464 -1.493454
C  -6.103852 0.365066 0.357489
C  -6.099517 -0.143964 -0.967363
C  -8.443156 0.482618 -1.357286
H  4.101811 3.311705 -0.01489
H  2.360688 3.265847 0.36814
H  3.543619 2.48081 1.465044
H  1.87572 2.256701 -1.969132
H  3.618132 2.301638 -2.349067
H  2.718736 0.765633 -2.502492
H  6.045217 1.767284 -1.176655
H  4.868858 -2.67707 0.950701
H  2.653239 -2.133743 2.169932
H  2.270998 -2.810486 0.550737
H  1.075987 -1.755631 1.386559
H  0.533027 1.811802 -0.029181
H  7.804402 0.017538 -0.797162
H  7.225529 -2.171586 0.249815
H  -1.699117 1.368171 0.577873
H  -2.71317 -0.118832 2.520096
H  -2.085608 -1.45212 1.508205
H  -2.874501 -1.318647 -1.113237
H  -4.944197 0.659991 2.16432
H  -4.952824 -1.141053 -2.51356
H  -7.000338 0.823707 0.783462
H  -8.305614 1.548437 -1.094572
H  -8.839657 -0.075289 -0.488311
H  -9.137151 0.39427 -2.204412
