program: Gaussian 09
title: 000162241
version: EM64L-G09RevD.01
frameworkgroup: C1[X(C16H12Cl2N4O4S)]
method: RPBEPBE
basis: SDD
operation: Freq
keyword: #p
keyword: freq=noraman
keyword: PBEPBE/SDD
title: #p freq=noraman PBEPBE/SDD
converged: YES YES NO NO
title: Mulliken charges:
elementType: Cl Cl S O O O O N N N N C C C C C C C C C C C C C C C C H H H H H H H H H H H H
charge: 0.028867 -0.055014 0.995599 -0.195043 -0.563731 -0.493335 -0.495973 -0.274828 -0.026876 -0.050120 -0.042280 -0.438147 0.238262 0.175545 0.440440 -0.761572 -0.332272 -0.371946 0.304681 -0.031457 -0.266434 -0.205100 -0.183986 -0.308716 -0.232477 -0.117522 -0.177227 0.297422 0.241317 0.256245 0.256707 0.301936 0.286166 0.327407 0.257344 0.257096 0.294954 0.276281 0.387791
chargesum: 0.00000
title: Mulliken charges with hydrogens summed into heavy atoms:
elementType: Cl Cl S O O O O N N N N C C C C C C C C C C C C C C C C
charge: 0.028867 -0.055014 0.995599 -0.195043 -0.175940 -0.493335 -0.495973 -0.274828 -0.026876 -0.050120 -0.042280 -0.140725 0.238262 0.175545 0.440440 -0.007304 -0.030337 -0.085780 0.304681 -0.031457 0.060972 0.052244 0.073109 -0.308716 0.062476 -0.117522 0.099054
polarizability: 4.72648339e+02 -3.38953384e+01 2.46274041e+02 -1.13716979e+01 3.37948283e-01 2.07195228e+02
1716.lowfreq: -1.9978 -1.6463 -0.0018 -0.0017 0.0012 1.5106 6.2889 12.9216 21.0602
frequency: 6.0274 12.7749 21.0400 25.8702 46.9743 48.8508 67.9881 76.4887 96.0616 115.8444 117.3703 136.6765 145.4117 151.1903 168.8018 174.7201 199.8232 217.6562 234.4312 245.7522 250.2638 274.7463 279.8389 293.9845 307.2341 321.8196 353.3733 354.2618 366.6402 370.2116 389.6877 398.7476 413.7157 459.9229 470.8462 480.5197 508.5334 521.1239 543.8556 544.6517 570.9426 600.6547 607.1024 624.3355 648.9157 682.3222 704.0286 707.9589 722.3504 744.7988 791.7922 825.9908 832.0360 834.7557 840.9945 849.4908 909.4772 933.7312 947.1357 965.7905 968.7738 974.0809 978.1323 983.8709 995.0501 1015.5458 1030.8274 1046.4454 1047.2518 1049.4547 1063.3354 1075.2043 1118.4774 1123.3464 1133.4778 1168.2031 1182.7969 1187.7192 1235.1942 1252.0278 1294.3917 1297.2099 1355.3890 1361.9262 1374.3826 1388.4609 1401.5276 1402.2540 1408.7943 1436.5055 1452.0191 1455.9051 1480.4330 1553.5516 1577.5854 1592.4787 1593.9426 1601.6085 1645.2357 2978.8254 2983.3160 3059.2492 3115.4843 3155.0153 3164.4188 3166.8497 3167.8478 3184.0992 3191.4177 3194.9189 3481.0187
redmass: 8.1455 10.3861 8.0681 6.8239 7.2611 5.9926 9.3768 8.1920 5.6180 7.4147 10.5337 4.2767 3.2963 8.1113 1.4084 1.6444 8.9375 6.5774 4.8978 5.3409 8.5379 6.8053 6.6088 5.8286 6.7720 6.9727 6.1947 7.1551 6.3759 6.8936 11.4888 6.3495 3.0717 7.6330 3.5648 6.9450 3.2497 7.0037 7.9805 8.0733 5.2754 6.0440 6.2214 7.1529 6.1134 8.1366 7.9699 3.9393 6.9447 4.1429 6.8972 5.7673 1.2537 1.5135 1.5023 7.5142 4.1298 3.5872 1.5343 1.3310 6.4594 1.5647 1.3336 2.2573 3.8885 3.6695 5.1405 2.5778 1.2527 3.9519 1.6899 2.6578 1.7363 2.3709 1.9000 2.1444 1.3316 1.1946 1.3996 1.6304 3.2207 1.2736 3.7040 4.0338 7.8047 10.8145 1.7275 4.2298 3.2942 2.4003 1.0901 1.0645 2.6110 6.7226 7.1377 8.3985 7.4299 6.2318 12.1869 1.0767 1.0422 1.0968 1.0988 1.0920 1.0899 1.0908 1.0903 1.0972 1.0954 1.0958 1.0662
irintensity: 0.6030 0.1707 1.6945 0.2801 0.3090 0.8524 0.9488 0.1927 1.5945 1.4257 3.8082 0.2164 2.7479 4.2360 3.8187 36.2057 12.5398 2.2734 15.4836 12.1353 5.6271 3.8345 31.6230 34.0249 6.7433 2.1742 2.2763 1.9711 5.5148 5.6248 68.0321 7.1399 0.0564 10.6300 10.8019 34.4223 20.5544 33.7318 30.3923 84.9663 23.5027 49.1813 15.7216 0.1869 7.9970 26.1065 7.0920 0.5647 13.0292 4.7428 23.5146 76.7792 2.2071 17.5610 90.5517 21.7863 45.3404 10.6904 10.4036 4.1511 80.5219 15.0198 0.9975 21.9982 54.6940 19.9354 82.5592 15.0907 48.4839 69.7760 29.4847 51.1974 27.8476 59.7259 11.1928 45.7991 7.4992 5.3392 10.3029 11.2236 205.3038 0.2319 18.0291 21.0873 0.8743 17.5332 27.7020 1.7029 7.7820 54.3663 16.8832 17.5568 326.3516 18.5719 4.8498 14.0389 7.8299 4.4766 167.7813 15.3701 8.7257 8.1872 7.8410 12.5312 7.4423 2.1618 2.5924 1.1632 2.4254 1.3099 50.7170
temp: 298.150 k
press: 1.00000 atm
elementType: 17 17 16 8 8 8 8 7 7 7 7 6 6 6 6 6 6 6 6 6 6 6 6 6 6 6 6 1 1 1 1 1 1 1 1 1 1 1 1
symmnumber: 1
zpe: 674117.3 jmol-1
zpe.correction: 0.256758 hartree
zpe.thermalcorrener: 0.283000 hartree
zpe.thermalcorrenthalpy: 0.283945 hartree
zpe.thermalcorrgfe: 0.195033 hartree
zpe.sumelectzpe: -2452.813543 hartree
zpe.sumelectthermal: -2452.787301 hartree
zpe.sumelectthermalent: -2452.786357 hartree
zpe.sumelectthermalfe: -2452.875268 hartree
dipole: 2.0096 -3.4915 1.2714
dipole: 4.2244
quadrupole: -190.6543 -174.8960 -175.8160
quadrupole: -6.1604 -16.3622 -14.9741
quadrupole: -10.1989 5.5595 4.6394 -6.1604 -16.3622 -14.9741
hfenergy: -2453.0703011 hartree
pointgroup: C01 [X(C16H12Cl2N4O4S1)]
dipole: -0.7011114 -0.2902755 1.4786852 debye
polarizability: 460.7895845|-38.2432674|212.6442113|-50.0116436|10.313362|252.6838133 unknown
InChI: InChI=1S/C16H12Cl2N4O4S/c1-9-15(16(23)22(21-9)11-4-2-10(17)3-5-11)20-19-14-8-12(27(24,25)26)6-7-13(14)18/h2-8,15,24H,1H3
charge 0 multiplicity 1
39 atoms
Cl -3.395522 1.893269 3.40595
Cl 7.909308 -0.109078 -2.698123
S  -4.828833 -0.277474 -2.486901
O  1.765553 1.583105 0.381997
O  -4.290021 1.252821 -3.38714
O  -3.853855 -1.499774 -2.898892
O  -6.435416 -0.42075 -2.607636
N  2.711082 -0.617108 0.368077
N  2.366663 -1.915344 0.881482
N  -0.649423 -0.295652 0.895176
N  -1.464422 0.439753 1.590407
C  0.681257 -0.384369 1.535093
C  1.220856 -1.809123 1.523331
C  1.755789 0.366799 0.68488
C  3.933148 -0.481168 -0.359092
C  0.53997 -2.982523 2.150869
C  4.31672 0.77312 -0.903524
C  4.763661 -1.61882 -0.530577
C  -2.762784 0.602133 0.996256
C  -4.380985 0.367677 -0.781165
C  -3.092031 0.136877 -0.307718
C  5.529541 0.882021 -1.615755
C  5.973691 -1.505225 -1.243387
C  -3.758229 1.286598 1.746766
C  -5.382991 1.039287 -0.055919
C  6.342638 -0.255293 -1.777095
C  -5.055831 1.501082 1.234353
H  0.662279 0.056996 2.553438
H  0.360339 -2.810423 3.228569
H  1.149019 -3.892064 2.029922
H  -0.447487 -3.149012 1.680279
H  3.678729 1.64921 -0.771798
H  4.456074 -2.577684 -0.109274
H  -2.332868 -0.394036 -0.892093
H  5.83118 1.844857 -2.037704
H  6.616879 -2.379088 -1.379748
H  -6.381684 1.182382 -0.47945
H  -5.797979 2.027411 1.839991
H  -4.403417 1.089407 -4.368847
