program: Gaussian 09
title: 000162070
version: EM64L-G09RevD.01
frameworkgroup: C1[X(C8H14O2)]
method: RPBEPBE
basis: SDD
operation: Freq
keyword: #pfreq=noraman
keyword: PBEPBE/SDD
title: #p freq=noraman PBEPBE/SDD
converged: YES YES NO NO
title: Mulliken charges:
elementType: O O C C C C C C C C H H H H H H H H H H H H H H
charge: -0.287790 -0.252388 -0.052046 -0.354484 -0.306795 -0.713270 -0.712486 0.269138 -0.215109 -0.475825 0.191443 0.194224 0.217483 0.240488 0.232969 0.230786 0.208808 0.212208 0.222357 0.207671 0.218746 0.249131 0.227316 0.247425
chargesum: 0.00000
title: Mulliken charges with hydrogens summed into heavy atoms:
elementType: O O C C C C C C C C
charge: -0.287790 -0.252388 0.139396 0.057223 0.166662 -0.061468 -0.063711 0.269138 0.034022 -0.001084
polarizability: 1.26658411e+02 -4.91382748e+00 7.37860781e+01 -3.80162432e+00 -9.07855261e-01 8.39088816e+01
1716.lowfreq: -15.5387 -7.9561 -0.0008 -0.0008 -0.0008 7.3014 21.1574 42.0638 79.7673
frequency: 20.8090 42.0332 79.7135 105.8610 120.3997 188.6253 207.0858 212.8647 231.5835 262.8972 292.7931 361.0491 425.2380 437.9974 508.1182 548.3388 654.9775 763.9392 779.5870 790.0941 848.0765 889.4467 914.2291 949.8942 966.9508 993.7790 1005.4887 1022.1494 1050.1983 1061.5095 1110.2593 1130.4082 1135.4653 1181.9279 1222.1723 1260.1752 1286.7795 1288.8186 1340.5107 1346.4446 1355.0212 1386.3861 1390.7462 1410.2667 1464.4207 1466.8765 1475.4514 1480.0153 1485.2334 1488.6407 1620.9303 1641.6528 2953.8814 2974.7722 2977.8949 2983.0394 3006.8044 3035.5133 3065.7437 3070.4922 3071.9520 3075.1985 3084.1408 3103.8238 3156.8501 3219.8449
redmass: 4.4386 3.5217 2.5049 2.8393 2.1505 2.4000 2.4318 1.2076 1.4813 2.4266 3.6074 2.0372 2.9681 2.9463 1.7662 3.1737 3.2631 1.7991 3.3605 1.5109 3.3630 2.4960 2.2390 1.5743 1.3675 1.4073 1.0741 1.5298 2.9367 1.6067 1.6271 2.0340 3.8332 1.9362 1.1514 1.2302 1.3906 1.3694 1.6112 1.5200 1.3695 1.2148 1.2129 1.2245 1.0652 1.0658 1.0479 1.0605 1.0626 1.0528 11.3372 4.5577 1.0809 1.0361 1.0378 1.0598 1.0585 1.0996 1.1052 1.0996 1.1004 1.1003 1.0997 1.0598 1.0957 1.1157
irintensity: 0.7631 1.5715 1.7414 1.2738 0.7174 2.6033 3.1053 0.2795 0.2794 1.3924 10.5978 1.9282 0.1722 3.2024 0.0593 0.3675 2.3159 11.9771 23.0064 3.1203 9.0333 9.6575 13.4577 28.4080 20.9347 35.5787 49.5419 6.8029 3.9897 20.8455 6.7679 48.5572 392.4737 1.5992 3.8765 0.9610 22.0548 16.4071 1.1342 3.0210 2.6921 20.0253 17.8311 71.9722 4.3802 1.6391 19.7295 14.8636 16.4680 8.7137 150.8655 18.0425 22.5710 38.4671 19.8589 41.9010 22.5681 9.1531 16.9154 50.3293 61.3236 52.8047 53.7999 4.5723 4.3338 8.2353
temp: 298.150 k
press: 1.00000 atm
elementType: 8 8 6 6 6 6 6 6 6 6 1 1 1 1 1 1 1 1 1 1 1 1 1 1
symmnumber: 1
zpe: 535234.9 jmol-1
zpe.correction: 0.203860 hartree
zpe.thermalcorrener: 0.216074 hartree
zpe.thermalcorrenthalpy: 0.217018 hartree
zpe.thermalcorrgfe: 0.164181 hartree
zpe.sumelectzpe: -462.874716 hartree
zpe.sumelectthermal: -462.862502 hartree
zpe.sumelectthermalent: -462.861558 hartree
zpe.sumelectthermalfe: -462.914396 hartree
dipole: -0.9755 0.2125 -1.6065
dipole: 1.8915
quadrupole: -54.9883 -62.7484 -63.2570
quadrupole: -0.6053 -7.7476 1.1395
quadrupole: 5.3429 -2.4172 -2.9258 -0.6053 -7.7476 1.1395
hfenergy: -463.0785764 hartree
pointgroup: C01 [X(C8H14O2)]
dipole: 0.3898483 0.1086919 0.6244821 debye
dipolederiv: -1.7815563 -0.1741842 -0.0066461 -0.1967431 -0.3008346 -0.0221054 0.0269616 -0.0166783 -0.4567778 -0.725668 -0.0446448 -0.0147165 -0.0783162 -0.335082 -0.068308 -0.2138873 -0.0868413 -0.8734736 0.1113866 0.0040253 -0.0347352 0.0111721 0.0871608 0.0014449 -0.0142056 -0.0200164 0.1225271 0.1325323 0.0108988 -0.0109707 -0.0296792 0.0383774 0.0034221 -0.0118382 -0.0155107 0.0602223 0.8049137 0.0357252 -0.1205642 0.0282897 0.2689959 -0.0259948 -0.349583 -0.041835 0.2534852 0.0325498 0.0077912 -0.01027 0.0295157 -0.0713749 -0.0547618 -0.0431202 -0.0164903 0.041519 0.0933629 0.0295357 -0.018694 0.0396388 -0.0876111 -0.0217924 -0.0229745 0.0025597 0.0591164 1.9867272 0.1936505 -0.0305977 0.2402532 0.2861646 0.0944849 0.0987162 0.1032615 1.0563057 -0.4319799 -0.0018616 0.2335976 -0.0118508 -0.1673064 0.046633 0.1713869 0.0389926 -0.0357863 0.0505165 0.0372404 -0.0705454 0.0549144 -0.2805226 0.0340964 0.073152 0.0515092 0.0694702 -0.0899507 0.0046479 0.1167379 0.0064517 0.0384158 -0.028423 0.0951924 -0.0099549 -0.1072916 -0.1500319 -0.0662467 -0.1188365 -0.0723305 -0.0007219 -0.0457081 -0.1057201 -0.0334402 0.0191909 0.0125342 0.0067365 0.1401733 0.022605 0.0300718 -0.0136065 0.1258422 0.0013297 -0.0549503 -0.0280302 -0.0641648 0.0218224 -0.0211228 -0.0971466 -0.1004577 0.1050115 -0.0603878 0.0327381 -0.066849 0.059877 -0.0322246 0.0428637 -0.0305712 0.1154448 0.0610229 0.0876675 -0.0248872 0.0210282 0.0311488 0.1234053 0.004084 0.0813896 0.0162255 0.1260594 -0.0379902 -0.0403584 0.0845251 0.0697411 -0.0519444 0.0545393 -0.0861851 0.0915851 -0.0373484 0.1457192 -0.041919 -0.1595919 -0.0837169 -0.0930314 -0.0432114 0.0628794 -0.0253014 -0.095783 -0.0480708 0.0560302 -0.1069908 -0.1045594 -0.078017 -0.0866679 0.0454306 -0.0428322 -0.0693112 -0.0692974 0.0456845 -0.0245073 0.0121862 0.1284204 -0.0304152 0.0654986 0.020101 0.1526917 -0.0391298 -0.0730705 0.0484393 0.0845156 -0.0599878 0.0819732 -0.0640982 0.0999508 -0.0871049 0.1355286 -0.0337898 0.0639722 -0.024113 -0.0684537 -0.0179185 0.168692 -0.0350854 -0.0161931 -0.0284959 -0.0444232 0.0173145 -0.0094794 0.0855682 -0.0090451 0.1688916 -0.0111958 0.0988403 -0.0098618 -0.0165355 0.1053535 -0.0147492 -0.0294899 -0.019 0.1794863 -0.027816 -0.0678077 -0.032567 -0.0130262 unknown
polarizability: 126.666088|4.3038457|73.8119395|-4.3576838|1.3573525|83.8753427 unknown
InChI: InChI=1S/C8H14O2/c1-4-7(3)6-10-8(9)5-2/h5,7H,2,4,6H2,1,3H3
charge 0 multiplicity 1
24 atoms
O  -0.296429 0.209429 0.141877
O  -1.948647 -0.207386 -1.458522
C  2.089157 0.540488 -0.308968
C  2.531882 -0.518975 0.737274
C  0.728831 0.217749 -0.944808
C  2.097843 1.963352 0.298812
C  2.734769 -1.940018 0.167335
C  -1.616426 -0.017621 -0.261882
C  -2.519048 0.004321 0.919747
C  -3.856535 -0.189395 0.786251
H  2.818227 0.513504 -1.148815
H  3.481605 -0.171928 1.190993
H  1.783193 -0.546056 1.552271
H  0.713075 -0.770402 -1.438774
H  0.434009 0.979244 -1.690544
H  1.376789 2.033534 1.132708
H  1.823052 2.726383 -0.453468
H  3.100825 2.215727 0.688744
H  1.788773 -2.374452 -0.204069
H  3.458362 -1.936647 -0.670289
H  3.124816 -2.622601 0.944373
H  -2.046303 0.184323 1.890898
H  -4.527647 -0.174082 1.651235
H  -4.293572 -0.366391 -0.203582
