program: Gaussian 09
title: 000162060
version: EM64L-G09RevD.01
frameworkgroup: C1[X(C10H18O2)]
method: RPBEPBE
basis: SDD
operation: Freq
keyword: #pfreq=noraman
keyword: PBEPBE/SDD
title: #p freq=noraman PBEPBE/SDD
converged: YES YES NO NO
title: Mulliken charges:
elementType: O O C C C C C C C C C C H H H H H H H H H H H H H H H H H H
charge: -0.469172 -0.201316 -0.175042 -0.482610 -0.105122 -0.431583 -0.504874 0.146934 -0.414977 -0.367189 -0.351100 -0.694934 0.259080 0.218976 0.250841 0.219569 0.208982 0.222329 0.249104 0.244695 0.183707 0.224825 0.195230 0.198573 0.198937 0.195164 0.341142 0.211917 0.209991 0.217924
chargesum: 0.00000
title: Mulliken charges with hydrogens summed into heavy atoms:
elementType: O O C C C C C C C C C C
charge: -0.128031 -0.201316 0.084038 -0.012793 0.114447 -0.000272 -0.011076 0.146934 -0.006444 0.026613 0.043001 -0.055101
polarizability: 1.30147985e+02 2.21688596e+00 1.02923509e+02 -1.65017664e-01 -3.17177154e+00 9.84148788e+01
1716.lowfreq: -9.2481 -0.0006 -0.0005 -0.0005 2.4917 16.2386 34.2574 47.9209 65.1458
frequency: 34.0761 47.7922 65.0704 80.2608 102.6169 143.6927 163.1120 185.6801 225.5469 239.0748 242.5678 264.3635 308.7661 405.4000 434.0975 473.7506 535.4558 544.9461 592.7411 631.8958 714.2916 734.6592 795.5846 831.6079 850.1970 891.4758 907.0418 912.4950 938.8308 946.5604 992.6120 1011.0809 1024.8088 1044.3618 1073.9171 1078.3139 1108.9486 1121.1467 1135.6194 1155.1934 1163.2178 1199.0776 1204.0868 1218.7915 1248.7235 1256.5260 1270.1811 1272.5649 1289.4316 1293.2038 1308.1866 1312.8827 1326.7833 1341.1400 1353.5081 1380.0532 1390.9041 1425.1455 1461.4439 1466.1269 1474.6715 1477.3251 1478.6511 1483.7943 1487.5779 1657.4054 2951.4196 2956.2045 2959.3451 2969.8162 2973.3519 2977.5244 2987.3550 2997.0446 2997.5991 3014.5832 3020.3213 3040.9281 3067.3518 3069.9241 3073.4117 3077.0090 3086.1171 3577.9117
redmass: 3.3673 2.6743 1.8525 3.5832 2.8928 3.7045 2.4845 2.1035 2.6077 1.2729 1.2223 2.3372 3.8905 3.6766 2.8319 3.4476 2.9229 3.6131 2.9996 2.6659 2.0332 1.2128 1.2943 1.9144 2.5364 1.8260 1.8328 1.9213 1.5268 1.8980 2.2984 1.6887 2.6120 1.9347 2.4178 1.9206 1.4977 1.6982 2.4406 2.4377 1.6726 1.3773 1.4900 1.5331 1.2827 1.2302 1.2875 1.3529 1.2282 1.2070 1.2718 1.2747 1.5755 1.4609 1.6513 1.4702 1.2172 1.0821 1.0777 1.0740 1.0796 1.0695 1.0436 1.0936 1.0835 12.1756 1.0805 1.0642 1.0613 1.0601 1.0365 1.0815 1.0656 1.0657 1.0948 1.0621 1.0990 1.1019 1.0989 1.1008 1.0993 1.0984 1.1041 1.0663
irintensity: 0.9327 1.5713 0.9564 4.6971 0.6699 4.0868 9.2455 1.6732 6.3592 36.5179 62.2037 23.8949 7.3812 4.1432 3.0262 13.9558 1.4545 6.2780 16.8048 3.4995 3.3719 8.6191 2.3898 10.7489 13.2559 4.1011 19.9627 11.7710 4.4546 27.9684 19.2435 2.2450 12.8807 7.5326 1.0113 8.8883 38.1160 4.2611 8.6379 41.9362 39.7977 11.1209 1.9752 9.7572 16.7585 16.5684 7.4527 4.0042 4.5684 4.1543 5.4265 0.2883 5.6451 21.6231 1.5527 15.6806 11.4074 22.8805 2.5438 1.3589 9.3869 1.2599 13.1410 5.6495 16.4764 163.4789 15.2067 9.7368 16.6768 81.9519 32.7557 24.4013 7.9062 36.8435 9.5376 25.3762 2.9183 69.2348 22.1353 89.0447 52.3463 18.1365 35.0153 6.7693
temp: 298.150 k
press: 1.00000 atm
elementType: 8 8 6 6 6 6 6 6 6 6 6 6 1 1 1 1 1 1 1 1 1 1 1 1 1 1 1 1 1 1
symmnumber: 1
zpe: 688021.9 jmol-1
zpe.correction: 0.262054 hartree
zpe.thermalcorrener: 0.275892 hartree
zpe.thermalcorrenthalpy: 0.276837 hartree
zpe.thermalcorrgfe: 0.220511 hartree
zpe.sumelectzpe: -541.330832 hartree
zpe.sumelectthermal: -541.316993 hartree
zpe.sumelectthermalent: -541.316049 hartree
zpe.sumelectthermalfe: -541.372375 hartree
dipole: -2.0973 1.3359 -1.7881
dipole: 3.0627
quadrupole: -74.2014 -70.7234 -80.7569
quadrupole: 7.3726 -4.0732 4.8569
quadrupole: 1.0258 4.5038 -5.5296 7.3726 -4.0732 4.8569
hfenergy: -541.5928856 hartree
pointgroup: C01 [X(C10H18O2)]
dipole: -0.8621268 0.4920566 -0.6830521 debye
polarizability: 129.9543737|2.921289|103.0012729|-1.0876247|-3.32414|98.5307265 unknown
InChI: InChI=1S/C10H18O2/c1-2-3-6-9(11)8-5-4-7-10(8)12/h8-9,11H,2-7H2,1H3
charge 0 multiplicity 1
30 atoms
O  0.712397 -1.656134 -1.245795
O  2.191555 -0.929741 1.755865
C  0.733881 0.289193 0.154905
C  1.132452 1.214197 -1.02413
C  -0.087778 -0.963367 -0.205886
C  2.501865 1.82476 -0.599389
C  3.213371 0.671202 0.149031
C  2.076448 -0.107829 0.815437
C  -1.513483 -0.671882 -0.719451
C  -2.444859 -0.037151 0.339083
C  -3.908973 0.083281 -0.142848
C  -4.83305 0.737847 0.906272
H  0.166326 0.859523 0.919942
H  0.377644 1.991326 -1.235302
H  1.260066 0.598613 -1.932307
H  -0.142127 -1.601123 0.704287
H  2.345657 2.67953 0.086788
H  3.079759 2.193299 -1.464027
H  3.977839 0.979864 0.88177
H  3.700572 -0.01898 -0.570012
H  -1.962997 -1.630744 -1.056779
H  -1.450564 -0.022616 -1.614437
H  -2.417396 -0.642686 1.26949
H  -2.073975 0.971777 0.612574
H  -3.936532 0.671373 -1.082796
H  -4.292148 -0.926157 -0.396818
H  0.328812 -2.555678 -1.397327
H  -4.846384 0.151069 1.844132
H  -4.489715 1.759646 1.155693
H  -5.873162 0.811589 0.539336
