program: Gaussian 09
title: 000162053
version: EM64L-G09RevD.01
frameworkgroup: C1[X(C11H24O2)]
method: RPBEPBE
basis: SDD
operation: Freq
keyword: #pfreq=noraman
keyword: PBEPBE/SDD
title: #p freq=noraman PBEPBE/SDD
converged: YES YES NO NO
title: Mulliken charges:
elementType: O O C C C C C C C C C C C H H H H H H H H H H H H H H H H H H H H H H H H
charge: -0.306013 -0.448229 -0.056813 -0.405124 -0.405845 -0.437336 0.389481 -0.053550 -0.755308 -0.740996 -0.768006 -0.726477 -0.526048 0.184662 0.203408 0.213435 0.186208 0.239858 0.194133 0.211955 0.182704 0.229001 0.207221 0.214941 0.214624 0.208037 0.232141 0.243750 0.216913 0.210310 0.211096 0.231126 0.241584 0.325420 0.206381 0.229704 0.201650
chargesum: 0.00000
title: Mulliken charges with hydrogens summed into heavy atoms:
elementType: O O C C C C C C C C C C C
charge: -0.306013 -0.122809 0.127849 0.011719 0.020222 -0.031248 0.389481 0.129154 -0.104144 -0.086195 -0.097033 -0.042670 0.111687
polarizability: 1.45665132e+02 8.23025487e-01 1.22885823e+02 1.13961858e+00 -9.11888036e-01 1.13423522e+02
1716.lowfreq: -9.5007 -0.0007 -0.0006 -0.0002 3.1510 20.5512 32.2864 43.1810 62.3585
frequency: 31.6591 42.1991 62.3452 79.5832 87.1168 104.1139 127.3070 155.7037 174.0822 213.0385 220.0986 228.7203 233.2978 261.4145 270.8892 277.4772 306.5670 319.4616 346.7951 352.8621 372.2082 397.4454 422.9221 474.7253 484.8023 531.9530 595.9070 687.8683 742.2305 776.6141 811.5321 842.6354 879.8435 907.3605 910.0487 928.9156 970.1592 982.5724 993.1734 1016.6254 1018.7292 1043.3889 1065.9109 1081.4296 1093.2428 1099.3295 1111.7306 1134.5630 1153.0151 1170.2010 1185.3269 1211.5673 1240.5100 1249.4828 1254.4204 1281.3542 1298.4453 1302.7138 1306.2708 1337.1428 1348.5367 1355.8285 1369.4763 1378.2822 1384.1456 1392.8776 1407.1400 1434.2412 1444.0351 1457.1848 1460.3214 1461.4266 1465.3169 1469.8985 1476.2317 1479.9267 1481.3692 1482.1639 1485.0974 1489.3584 1490.6254 2905.9167 2923.0146 2939.0946 2959.5878 2966.9320 2974.1155 2976.6003 2979.1757 2985.5204 3000.1467 3014.5235 3015.5662 3028.1823 3055.8885 3064.8780 3070.1377 3076.8662 3082.3983 3085.0900 3088.9967 3091.9580 3097.2805 3102.9405 3547.5032
redmass: 3.3420 3.5243 2.4068 2.4566 3.1583 2.1602 2.0682 2.1799 1.1820 1.1022 1.9832 1.1925 1.3075 1.4450 2.6387 1.7652 2.8197 1.1489 2.2785 2.8552 2.7694 2.3131 2.7963 3.1246 2.6143 2.8457 2.6934 3.7518 1.2133 2.4650 1.7779 2.0045 2.1534 1.5458 1.8479 1.7725 1.3766 1.4525 1.6622 3.8087 2.0322 2.8338 1.8714 1.8011 1.7083 1.9442 1.2688 1.8649 1.4035 2.3249 2.2819 1.6347 1.4675 1.3217 2.1721 1.2308 1.4246 1.1642 1.2821 1.4693 1.4675 1.5800 1.2249 1.2493 1.2215 1.2061 1.5473 1.1253 1.0759 1.0623 1.0567 1.0567 1.0566 1.0542 1.0604 1.0535 1.0699 1.0674 1.0548 1.0521 1.0564 1.0814 1.0853 1.0331 1.0605 1.0613 1.0583 1.0370 1.0367 1.0367 1.0358 1.1015 1.0965 1.0999 1.1023 1.0983 1.0992 1.0982 1.0983 1.1000 1.0977 1.0991 1.0994 1.0997 1.0658
irintensity: 0.7605 0.6015 3.0021 2.4123 0.6828 0.8304 0.8939 1.5416 0.7868 0.9450 0.7949 6.7649 0.6068 0.6027 0.4035 3.4647 1.4147 160.9271 13.9740 2.7594 6.4589 5.5182 9.6528 6.5315 0.4952 1.4091 2.4842 8.6670 7.1552 1.7145 5.0832 8.7991 11.1529 0.5387 17.5724 1.0997 0.4515 7.6021 25.0280 67.2291 4.4756 8.2376 11.9381 15.4363 38.6700 4.4202 0.1716 8.7665 9.3955 45.9280 9.7992 6.9480 58.7251 23.9908 25.5923 1.3329 5.5026 0.2676 11.1997 2.5822 0.4811 3.9720 33.7509 8.3913 25.1934 20.7769 29.3522 1.1854 1.2438 7.5502 2.6384 5.3159 4.3326 7.5761 3.8394 4.6735 19.3821 2.3114 17.7852 2.3615 16.7118 36.3419 84.1291 79.1287 1.2217 23.3005 47.2966 31.5010 28.6004 23.0718 14.9131 66.0435 28.1716 4.3560 55.1722 48.6278 0.5055 90.2244 43.8115 23.0820 19.6660 46.1631 27.0221 35.6105 4.6242
temp: 298.150 k
press: 1.00000 atm
elementType: 8 8 6 6 6 6 6 6 6 6 6 6 6 1 1 1 1 1 1 1 1 1 1 1 1 1 1 1 1 1 1 1 1 1 1 1 1
symmnumber: 1
zpe: 870336.2 jmol-1
zpe.correction: 0.331494 hartree
zpe.thermalcorrener: 0.349156 hartree
zpe.thermalcorrenthalpy: 0.350100 hartree
zpe.thermalcorrgfe: 0.286169 hartree
zpe.sumelectzpe: -582.883911 hartree
zpe.sumelectthermal: -582.866248 hartree
zpe.sumelectthermalent: -582.865304 hartree
zpe.sumelectthermalfe: -582.929235 hartree
dipole: 1.9544 0.6480 1.7963
dipole: 2.7324
quadrupole: -81.4533 -85.1457 -81.0557
quadrupole: -6.0046 -2.3942 -1.7192
quadrupole: 1.0982 -2.5941 1.4958 -6.0046 -2.3942 -1.7192
hfenergy: -583.2154041 hartree
pointgroup: C01 [X(C11H24O2)]
dipole: 0.768898 0.24535 0.7101194 debye
polarizability: 145.670815|0.5977591|122.8768763|1.2455858|-0.8945484|113.4267865 unknown
InChI: InChI=1S/C11H24O2/c1-9(10(2)12)7-6-8-11(3,4)13-5/h9-10,12H,6-8H2,1-5H3
charge 0 multiplicity 1
37 atoms
O  2.841118 0.874543 -0.509903
O  -3.975349 -1.440975 0.442392
C  -2.372275 0.4821 0.545674
C  -1.241521 -0.249283 -0.221497
C  0.167462 -0.032747 0.377106
C  1.236157 -0.878081 -0.350909
C  2.707916 -0.528858 -0.007164
C  -3.791941 -0.003669 0.126199
C  -2.264748 2.022316 0.432038
C  3.661084 -1.463942 -0.787953
C  2.985267 -0.59884 1.51277
C  -4.114916 0.120675 -1.367117
C  4.127275 1.531865 -0.294667
H  -2.264626 0.222365 1.62564
H  -1.234697 0.090037 -1.277567
H  -1.474567 -1.333822 -0.23908
H  0.146076 -0.292245 1.456031
H  0.460684 1.030752 0.303156
H  1.071653 -1.954905 -0.144078
H  1.118517 -0.736932 -1.443836
H  -4.533412 0.591123 0.708553
H  -1.330784 2.39352 0.888565
H  -3.109379 2.524123 0.94249
H  -2.268049 2.343274 -0.626399
H  3.488047 -2.517017 -0.499592
H  4.722991 -1.234076 -0.585163
H  3.483276 -1.366985 -1.873855
H  2.407093 0.171039 2.05196
H  2.692953 -1.589621 1.906479
H  4.057012 -0.451749 1.739105
H  -4.019849 1.166964 -1.70651
H  -5.149063 -0.215618 -1.553763
H  -3.437694 -0.512448 -1.964637
H  -3.774162 -1.577549 1.403667
H  4.365688 1.654777 0.781871
H  4.023117 2.530189 -0.750703
H  4.966445 1.000499 -0.789402
