program: Gaussian 09
title: 000162049
version: EM64L-G09RevD.01
frameworkgroup: C1[X(C3H6Cl2O)]
method: RPBEPBE
basis: SDD
operation: Freq
keyword: #p
keyword: freq=noraman
keyword: PBEPBE/SDD
title: #p freq=noraman PBEPBE/SDD
converged: YES YES NO NO
title: Mulliken charges:
elementType: Cl Cl O C C C H H H H H H
charge: -0.124974 -0.050798 -0.185264 -0.153654 -0.562552 -0.487614 0.273170 0.284128 0.294696 0.218657 0.247981 0.246224
chargesum: 0.00000
title: Mulliken charges with hydrogens summed into heavy atoms:
elementType: Cl Cl O C C C
charge: -0.124974 -0.050798 -0.185264 0.119516 0.016272 0.225248
polarizability: 7.31644069e+01 -1.05930057e+01 5.88333916e+01 2.40643313e+00 -1.36712674e+00 3.61028062e+01
1716.lowfreq: -11.4213 -0.0028 -0.0019 0.0012 3.7037 9.3763 94.0693 99.5093 144.4706
frequency: 94.0110 99.4950 144.4537 179.0805 244.8097 262.4811 356.4683 486.4506 601.0797 667.0159 810.6573 965.3069 1035.2327 1111.1328 1122.4958 1143.2665 1174.8896 1229.4620 1265.9612 1366.8048 1433.8611 1437.5143 1458.1164 1469.5503 2977.9884 3054.6871 3078.6379 3092.6187 3144.2220 3186.0131
redmass: 4.0582 2.2897 1.3587 5.3387 3.9455 6.1414 5.8994 2.9132 7.8433 6.1129 2.4461 2.2456 2.9483 1.2458 1.2751 1.3193 1.8934 1.6109 1.1608 1.3495 1.1063 1.2051 1.0516 1.0525 1.0327 1.0888 1.1029 1.0570 1.1019 1.1117
irintensity: 3.4327 4.0055 2.7013 13.4327 5.8141 12.2727 5.2447 4.4705 170.1796 16.8043 10.2911 22.1714 87.3590 5.2100 52.5394 34.5179 25.0641 47.3799 2.3527 19.3844 13.6946 18.9082 16.5300 18.3206 42.7170 20.9136 27.6146 3.4353 14.1407 2.2685
temp: 298.150 k
press: 1.00000 atm
elementType: 17 17 8 6 6 6 1 1 1 1 1 1
symmnumber: 1
zpe: 231440.1 jmol-1
zpe.correction: 0.088151 hartree
zpe.thermalcorrener: 0.095846 hartree
zpe.thermalcorrenthalpy: 0.096791 hartree
zpe.thermalcorrgfe: 0.054851 hartree
zpe.sumelectzpe: -1112.749193 hartree
zpe.sumelectthermal: -1112.741497 hartree
zpe.sumelectthermalent: -1112.740553 hartree
zpe.sumelectthermalfe: -1112.782492 hartree
dipole: 1.0082 1.4522 -1.0037
dipole: 2.0329
quadrupole: -56.0794 -46.1219 -49.3445
quadrupole: 7.0397 -1.0532 -2.0708
quadrupole: -5.5642 4.3934 1.1708 7.0397 -1.0532 -2.0708
hfenergy: -1112.8373439 hartree
pointgroup: C01 [X(C3H6Cl2O1)]
dipole: -0.5867841 0.3865692 0.3820237 debye
dipolederiv: -0.4997568 -0.3947876 -0.0254867 -0.1288576 -0.8232526 -0.0297279 -0.0082378 -0.076819 -0.2365082 -0.512943 -0.1892009 -0.0409336 -0.2355401 -0.3179567 -0.0538807 -0.0732138 -0.0667083 -0.1878551 -0.7658032 0.4168777 -0.0131866 0.3352365 -1.0998077 -0.0064697 -0.0925157 0.27116 -0.383169 0.7118465 0.1909211 0.126489 -0.0971378 1.5507177 -0.0193397 0.1758605 -0.2560935 0.4084059 0.4565396 0.3484742 0.1151086 0.323649 0.2893015 0.0816076 0.1091018 0.0422128 0.1714221 0.5099189 -0.2814406 -0.0303379 -0.1298577 0.4089033 0.0674009 -0.0805733 0.1572776 0.2959375 0.0043104 -0.070798 0.0159007 0.0213119 -0.0483408 -0.0673082 -0.0154437 0.000372 -0.1117085 0.0159752 -0.0438339 -0.0411384 0.0017859 -0.0479954 0.0200017 -0.051048 0.0275935 0.0843025 0.0514153 -0.0597641 -0.0447209 -0.0626844 0.0669502 -0.0175452 0.0060508 -0.0178629 -0.0351378 0.009232 0.0369763 -0.0626899 0.0264431 0.0677429 -0.0277829 0.0327487 -0.114141 -0.1526146 -0.0555791 0.0059184 -0.0020372 -0.1345131 -0.0021315 -0.0278876 0.0128968 -0.0663714 0.092486 0.0748442 0.0406574 0.003033 0.0801643 -0.0441308 0.0809318 -0.0156264 0.0993803 0.0544393 unknown
polarizability: 64.7047939|12.3284885|66.4333696|4.5149694|4.8205964|36.9624411 unknown
InChI: InChI=1S/C3H6Cl2O/c1-6-3(5)2-4/h3H,2H2,1H3
charge 0 multiplicity 1
12 atoms
Cl -1.159374 -1.974878 -0.094517
Cl 2.520333 0.63397 0.386187
O  -0.623873 0.761782 -0.415133
C  -0.093356 -0.326896 0.270017
C  1.293215 -0.663312 -0.238299
C  -1.895521 1.282681 0.121021
H  -0.180684 -0.268026 1.369256
H  1.642633 -1.623967 0.158709
H  1.333489 -0.634287 -1.335471
H  -1.79229 1.537322 1.193377
H  -2.690064 0.527924 -0.017052
H  -2.113609 2.186486 -0.464395
