program: Gaussian 09
title: 000013412
version: EM64L-G09RevD.01
frameworkgroup: C1[X(C7H3Cl5)]
method: RPBEPBE
basis: SDD
operation: Freq
keyword: #pfreq=noraman
keyword: PBEPBE/SDD
title: #p freq=noraman PBEPBE/SDD
converged: NO NO NO NO
title: Mulliken charges:
elementType: Cl Cl Cl Cl Cl C C C C C C C H H H
charge: 0.020435 0.020111 0.055304 0.055305 0.058846 0.681829 -0.317457 -0.319633 -0.075690 -0.076073 -0.086337 -0.774054 0.248298 0.248519 0.260597
chargesum: 0.00000
title: Mulliken charges with hydrogens summed into heavy atoms:
elementType: Cl Cl Cl Cl Cl C C C C C C C
charge: 0.020435 0.020111 0.055304 0.055305 0.058846 0.681829 -0.317457 -0.319633 -0.075690 -0.076073 -0.086337 -0.016640
polarizability: 1.67508416e+02 -2.91254590e-02 1.56364859e+02 -1.66012573e-03 -5.58788100e-01 4.81590864e+01
1716.lowfreq: -85.3915 -3.6892 -0.0019 0.0025 0.0030 4.0234 8.7590 63.5048 73.1618
frequency: -85.3560 63.5000 73.1570 101.8273 163.8754 205.7605 207.2589 213.5904 218.1708 306.9714 320.3076 324.3097 329.9543 334.7228 351.9346 436.0153 587.7722 589.4000 593.0350 623.4043 698.5173 755.0097 811.1848 902.6423 1022.0712 1037.9331 1062.9345 1224.6454 1319.4949 1334.2311 1361.7576 1404.0091 1460.0555 1463.6808 1527.3109 1551.5457 2995.3770 3085.5542 3125.2211
redmass: 1.0705 33.5985 13.2299 6.4717 7.2916 27.0713 28.4389 27.4210 29.1631 20.0287 24.2221 6.6220 12.4696 2.9203 29.3660 7.7893 6.3463 6.0679 10.8244 11.7144 9.7233 7.8932 12.4459 8.8054 1.4785 1.5068 9.9521 11.2114 7.7687 10.7630 10.2835 1.1949 1.1734 1.0684 5.4734 10.2530 1.0419 1.0913 1.1004
irintensity: 0.7725 0.0004 0.3089 0.8843 1.3956 0.1676 0.0010 0.0650 0.0818 0.2616 0.0629 0.2142 0.0247 1.8380 0.0686 8.1041 0.1239 0.6491 0.0010 60.4508 46.3230 0.1826 0.6026 0.6385 45.5561 7.4720 25.9322 26.2246 141.7375 3.0348 103.5546 5.0011 24.4680 21.7776 3.1734 3.1072 7.4989 9.5396 2.2140
temp: 298.150 k
press: 1.00000 atm
elementType: 17 17 17 17 17 6 6 6 6 6 6 6 1 1 1
symmnumber: 1
zpe: 204490.5 jmol-1
zpe.correction: 0.077886 hartree
zpe.thermalcorrener: 0.089577 hartree
zpe.thermalcorrenthalpy: 0.090521 hartree
zpe.thermalcorrgfe: 0.038439 hartree
zpe.sumelectzpe: -2567.960807 hartree
zpe.sumelectthermal: -2567.949117 hartree
zpe.sumelectthermalent: -2567.948173 hartree
zpe.sumelectthermalfe: -2568.000255 hartree
dipole: 0.0041 -2.0116 0.0442
dipole: 2.0121
quadrupole: -107.4136 -97.9750 -103.6820
quadrupole: -0.0133 -0.0001 -0.1010
quadrupole: -4.3901 5.0486 -0.6585 -0.0133 -0.0001 -0.1010
hfenergy: -2568.0386938 hartree
pointgroup: C01 [X(C7H3Cl5)]
dipole: -0.0030503 -0.7913815 -0.0189921 debye
dipolederiv: -0.5437103 -0.2900371 -0.004031 -0.2841118 -0.2337846 -0.0038408 -0.0097676 0.0003908 -0.0138184 -0.5415056 0.2915152 0.0038647 0.2853313 -0.2363602 -0.0037171 0.0096174 0.0004307 -0.0138137 -0.5061094 -0.2802233 0.0002114 -0.2851138 -0.1686347 0.0002751 0.0024471 0.0008395 0.0119632 -0.5033861 0.2819211 -0.0003886 0.2866642 -0.1714332 0.0003778 -0.0026231 0.0009599 0.0119865 -0.0093697 -0.0015515 -0.000011 -0.001585 -0.6635482 -0.0035432 -0.0000014 -0.0003393 0.0141693 -0.3789567 0.0022411 -0.0000889 0.002538 0.2144409 0.0040082 0.000021 0.0375516 0.0660185 0.6943877 0.5888012 0.015888 0.4104262 0.1972992 0.0161073 0.0216261 0.0126344 -0.0774114 0.690048 -0.5907033 -0.0154944 -0.4130445 0.2017025 0.0159159 -0.021357 0.0125561 -0.0768962 0.6280276 0.5267807 0.0041556 0.4723336 0.0057721 0.0004983 0.0014873 -0.0073292 -0.0162812 0.6233388 -0.5298669 -0.0039262 -0.475076 0.0106692 0.0003215 -0.0012761 -0.0075519 -0.0163649 -0.2648332 0.0028597 -0.000058 0.002723 0.8823201 -0.0004846 -0.0000325 0.0059234 -0.0288276 -0.015594 -0.0039584 0.000022 -0.0012085 -0.1875621 -0.0110492 -0.0000106 -0.0796445 0.0389878 0.0008697 0.0833664 -0.0877944 0.0222633 0.0692325 0.0095418 -0.0576088 0.0416296 0.0822128 0.002626 -0.0804175 0.0900398 -0.0214712 0.0686007 0.0093257 0.0593484 0.0423045 0.0793631 0.1241672 -0.0007274 -0.002389 -0.0006687 0.0112859 -0.0337366 -0.0018702 -0.0603558 -0.0612878 unknown
polarizability: 167.5084821|0.0088979|156.3621001|0.0183442|0.7767305|48.1617791 unknown
InChI: InChI=1S/C7H3Cl5/c1-2-3(8)5(10)7(12)6(11)4(2)9/h1H3
charge 0 multiplicity 1
15 atoms
Cl -2.789006 -1.595124 -0.020676
Cl 2.782682 -1.607562 -0.019852
Cl 2.786863 1.589564 -0.002553
Cl -2.778706 1.603006 -0.003462
Cl 0.007907 3.209608 0.006599
C  -0.003262 -1.461285 0.013339
C  -1.208777 -0.711618 0.005335
C  1.205995 -0.717593 0.005683
C  1.224021 0.696068 0.003148
C  -1.220189 0.702035 0.00278
C  0.003652 1.410513 0.005521
C  -0.008303 -2.975196 0.015954
H  0.892652 -3.371594 0.508435
H  -0.902289 -3.365136 0.526291
H  -0.020538 -3.366585 -1.019142
