program: Gaussian 09
title: 000164720
version: EM64L-G09RevD.01
frameworkgroup: C1[X(C10H10O4)]
method: RPBEPBE
basis: SDD
operation: Freq
keyword: #pfreq=noraman
keyword: PBEPBE/SDD
title: #p freq=noraman PBEPBE/SDD
converged: YES YES NO NO
title: Mulliken charges:
elementType: O O O O C C C C C C C C C C H H H H H H H H H H
charge: -0.284961 -0.250391 -0.437337 -0.244400 0.237508 0.264635 -0.328425 -0.338756 -0.342572 -0.320550 0.190561 -0.222599 -0.672922 0.115490 0.276465 0.275676 0.274750 0.279591 0.232089 0.232082 0.214863 0.230902 0.230903 0.387395
chargesum: 0.00000
title: Mulliken charges with hydrogens summed into heavy atoms:
elementType: O O O O C C C C C C C C C C
charge: -0.284961 -0.250391 -0.049941 -0.244400 0.237508 0.264635 -0.051959 -0.063080 -0.067823 -0.040958 0.190561 0.241573 0.003746 0.115490
polarizability: 1.98610205e+02 -4.23479444e+00 1.24849666e+02 1.01472384e-02 1.48350357e-03 5.76010979e+01
1716.lowfreq: -4.5027 0.0003 0.0008 0.0010 0.8630 9.4739 35.5646 63.3764 65.7590
frequency: 35.3229 63.3136 65.7585 82.2471 83.3021 128.9216 175.1219 231.8521 257.3959 263.5243 264.9188 346.8647 407.5100 433.7160 453.9485 483.3318 504.2308 594.0218 619.5993 628.5292 671.6143 702.6537 741.9958 780.2900 799.2095 802.7994 845.2515 876.1484 892.1968 1003.1091 1007.7280 1012.9785 1020.1627 1026.5960 1067.9613 1112.9289 1117.1683 1136.2711 1150.3154 1187.1842 1244.7744 1250.0617 1302.7405 1323.2065 1360.5931 1388.1270 1402.5406 1409.8170 1463.5204 1473.5840 1485.8488 1494.6443 1571.2649 1616.4563 1622.1572 1643.6123 2997.5457 3011.7603 3070.1931 3093.8744 3109.3648 3158.7819 3159.3104 3181.7736 3185.2259 3531.5290
redmass: 4.0813 2.5513 8.6792 5.6850 4.4792 2.7948 5.9530 1.6064 6.2865 6.2558 2.7360 4.1912 2.8539 5.3458 3.5016 8.7398 5.0918 1.2722 4.9843 7.0802 4.3744 3.3540 6.2949 4.7061 1.1140 5.0960 4.4987 1.2424 1.7291 4.8725 1.3578 1.3771 2.5574 2.6590 5.4875 2.1516 1.3902 1.4721 1.7163 1.1792 3.5460 1.1298 1.3095 2.7782 1.4146 6.0805 1.2708 3.8760 1.0403 1.0628 1.0832 2.5135 8.3395 10.3388 6.5958 8.7828 1.0359 1.0583 1.1066 1.0985 1.1026 1.0897 1.0896 1.0955 1.0969 1.0642
irintensity: 1.3726 1.0199 0.9800 0.1151 0.8416 3.0766 2.9658 0.4169 7.2051 1.2271 5.8272 8.0348 0.3030 23.5656 14.4200 15.7497 5.4687 98.6253 25.5131 0.4453 4.0535 119.3439 6.8970 0.0960 2.9969 3.4236 4.6574 0.2285 47.5211 274.1638 0.0351 0.1026 80.2448 45.6072 302.9915 4.3029 9.6111 5.9748 88.3180 60.9951 360.0767 0.0240 4.1947 79.7606 1.9423 14.7314 21.9883 34.0611 12.6167 5.0560 14.7840 16.9336 1.8522 233.1997 40.3251 217.0520 20.3324 18.5557 7.7593 29.6409 43.2787 0.1835 0.3268 2.0391 0.0174 52.1550
temp: 298.150 k
press: 1.00000 atm
elementType: 8 8 8 8 6 6 6 6 6 6 6 6 6 6 1 1 1 1 1 1 1 1 1 1
symmnumber: 1
zpe: 476295.0 jmol-1
zpe.correction: 0.181411 hartree
zpe.thermalcorrener: 0.194758 hartree
zpe.thermalcorrenthalpy: 0.195702 hartree
zpe.thermalcorrgfe: 0.140002 hartree
zpe.sumelectzpe: -686.960401 hartree
zpe.sumelectthermal: -686.947054 hartree
zpe.sumelectthermalent: -686.946110 hartree
zpe.sumelectthermalfe: -687.001810 hartree
dipole: -1.2536 -0.4480 0.0000
dipole: 1.3312
quadrupole: -63.6866 -86.6414 -82.0137
quadrupole: 14.7556 0.0013 0.0010
quadrupole: 13.7606 -9.1941 -4.5664 14.7556 0.0013 0.0010
hfenergy: -687.1418117 hartree
pointgroup: C01 [X(C10H10O4)]
dipole: 0.4884899 0.188918 0.0000038 debye
dipolederiv: -1.5940216 -0.4535933 -0.0000856 -0.7483645 -0.8124871 0.0000003 -0.0002903 -0.0001432 -0.2760785 -0.8487817 0.2421195 0.000055 0.0225827 -0.8948375 -0.0001258 -0.0000113 0.0001676 -0.3201327 -0.9508266 -0.4707464 0.0000895 -0.6356716 -0.7849149 0.0001156 0.0002083 0.000197 -0.4252866 -0.9489033 0.2951126 0.0000488 0.2392578 -0.8838086 0.0000693 0.0001519 -0.0001121 -0.3294388 -0.5381663 0.0683739 -0.0000014 0.0636746 0.0233375 -0.0000085 0.0000762 0.0000017 0.0048379 -0.6938889 0.0877962 0.000094 0.1223538 0.0168886 -0.0000208 0.000081 -0.0000088 0.0175823 -0.0068429 0.1946093 -0.0000343 0.0118888 -0.0631261 -0.0000002 0.0000733 -0.0000358 -0.1150828 -0.1188743 -0.1983469 -0.0000027 0.0240686 0.0377793 0.0000003 0.0000795 -0.0000052 -0.1159699 -0.012803 -0.1918655 0.000003 0.0333817 0.0280205 -0.0000168 -0.0000639 0.0000327 -0.1141094 0.0742613 0.1892111 -0.00003 -0.0427328 -0.039389 -0.000003 -0.0000803 -0.0000235 -0.1150995 2.0450217 0.0112101 -0.0000299 0.5392162 1.3467835 0.0001129 -0.0000436 -0.0000465 0.2298485 1.0357594 0.2325831 0.000071 0.1439181 0.287328 0.0000141 0.0001259 0.000053 0.3544713 -0.067804 -0.094992 -0.0000102 -0.0743591 -0.0620053 -0.0000257 -0.0000239 -0.0000275 0.0609045 2.1328548 -0.0086769 -0.0002801 0.1245583 1.3518872 -0.0001452 -0.000388 -0.0000817 0.2348971 0.0811743 -0.0649913 0.0000222 -0.0810012 0.0330671 0.000011 0.0000306 0.0000064 0.1527947 0.1132122 0.0598909 0.0000084 0.0347779 0.0081983 0.0000023 0.0000195 0.0000072 0.1552089 0.0961745 0.0537578 -0.0000009 0.0333912 0.005093 0.000007 -0.0000125 -0.0000027 0.1565248 0.0641076 -0.0635767 0.0000088 -0.0651983 0.0413817 0.0000151 -0.0000034 0.0000221 0.1601465 -0.0749797 -0.0435939 -0.0064551 0.0347007 0.0035241 0.0928169 -0.0470652 0.0877129 -0.0563764 -0.075012 -0.0435525 0.0064728 0.034741 0.003538 -0.0928089 0.0470754 -0.0877316 -0.0563807 -0.1839894 -0.0046585 -0.0000519 0.0119031 0.0739898 0.0000055 -0.0000627 -0.0000022 0.1175027 0.1161953 0.054797 -0.067999 -0.0039127 0.0139008 0.084577 -0.0445038 0.1023727 -0.0619921 0.1161512 0.0548338 0.0680629 -0.003878 0.0139197 -0.0845697 0.0445807 -0.102341 -0.0619626 0.2399815 0.0942984 0.0000445 0.1807041 0.2519315 -0.0000228 0.0000466 -0.0000117 0.4031909 unknown
polarizability: 198.7793498|-2.3299532|124.6805216|-0.0101057|-0.0017444|57.6010979 unknown
InChI: InChI=1S/C10H10O4/c1-2-14-10(13)8-5-3-7(4-6-8)9(11)12/h3-6,11H,2H2,1H3
charge 0 multiplicity 1
24 atoms
O  2.842463 0.460171 -0.000456
O  2.551656 -1.852894 -0.000303
O  -4.433348 -0.763528 0.000335
O  -4.152503 1.541495 0.000176
C  0.598323 -0.387081 -0.000505
C  -2.184054 0.091867 -0.000196
C  0.110076 0.94604 -0.000512
C  -0.310238 -1.477406 -0.000327
C  -1.276127 1.183261 -0.000359
C  -1.696804 -1.241284 -0.000175
C  2.061192 -0.696132 -0.000685
C  4.322695 0.245952 -0.000164
C  4.968883 1.626702 0.00003
C  -3.641662 0.395597 -0.00005
H  0.823094 1.774264 -0.000645
H  0.093983 -2.494548 -0.000318
H  -1.679059 2.20096 -0.000369
H  -2.40937 -2.070036 -0.000052
H  4.584492 -0.347993 0.894172
H  4.584853 -0.347912 -0.894447
H  6.069089 1.521985 0.000252
H  4.676124 2.200746 -0.895525
H  4.675758 2.200666 0.895518
H  -5.391613 -0.496691 0.000607
