program: Gaussian 09
title: 000164700
version: EM64L-G09RevD.01
frameworkgroup: C1[X(C2H7NO)]
method: RPBEPBE
basis: SDD
operation: Freq
keyword: #pfreq=noraman
keyword: PBEPBE/SDD
title: #p freq=noraman PBEPBE/SDD
converged: YES YES NO NO
title: Mulliken charges:
elementType: O N C C H H H H H H H
charge: -0.459391 -0.270943 -0.319284 -0.664701 0.209343 0.202050 0.222331 0.230126 0.207169 0.282089 0.361211
chargesum: 0.00000
title: Mulliken charges with hydrogens summed into heavy atoms:
elementType: O N C C
charge: -0.098180 0.011146 0.092109 -0.005075
polarizability: 3.78026543e+01 -2.24424779e+00 3.64638524e+01 -5.92930730e-01 6.40482411e-01 2.97153913e+01
1716.lowfreq: -16.0325 -7.5665 -0.0005 0.0003 0.0004 22.2450 140.3074 217.0040 328.1949
frequency: 140.2888 216.9951 328.1918 353.7155 476.6876 732.1101 811.8729 892.5514 949.6718 1061.1907 1109.8558 1144.4217 1252.1087 1273.6237 1358.4096 1382.1934 1430.7620 1451.5324 1464.6394 1489.3260 2938.8080 2990.3030 3014.6626 3089.8675 3096.4797 3343.0594 3553.6020
redmass: 2.2375 1.2583 1.4065 1.6455 2.4099 2.9986 1.2611 2.8033 1.6154 1.8252 1.6748 1.7787 1.2505 1.1453 1.2933 1.2158 1.1431 1.1076 1.0459 1.0496 1.0630 1.0355 1.0964 1.0993 1.1009 1.0756 1.0682
irintensity: 0.0553 4.6997 33.8578 106.2162 26.2906 34.2516 11.4884 16.8640 69.9521 5.8215 20.3687 3.1147 49.6867 4.7444 1.2883 21.0918 4.5762 3.1262 13.7309 8.5648 65.0136 24.6454 26.3532 36.8409 38.3628 6.1327 13.1564
temp: 298.150 k
press: 1.00000 atm
elementType: 8 7 6 6 1 1 1 1 1 1 1
symmnumber: 1
zpe: 247309.6 jmol-1
zpe.correction: 0.094195 hartree
zpe.thermalcorrener: 0.099624 hartree
zpe.thermalcorrenthalpy: 0.100568 hartree
zpe.thermalcorrgfe: 0.066514 hartree
zpe.sumelectzpe: -209.965955 hartree
zpe.sumelectthermal: -209.960527 hartree
zpe.sumelectthermalent: -209.959583 hartree
zpe.sumelectthermalfe: -209.993636 hartree
dipole: -0.6068 0.5035 -0.3137
dipole: 0.8486
quadrupole: -25.3563 -21.7670 -27.6399
quadrupole: -0.4228 -2.0909 2.1430
quadrupole: -0.4352 3.1540 -2.7188 -0.4228 -2.0909 2.1430
hfenergy: -210.0601506 hartree
pointgroup: C01 [X(C2H7N1O1)]
dipole: -0.2406174 0.2127327 -0.0911387 debye
dipolederiv: -0.686773 0.1018656 0.0440942 0.1128094 -0.50734 0.05951 -0.0555878 0.1809416 -0.0816869 -0.0345649 -0.2072703 0.0852319 -0.1484225 0.097996 0.0690986 0.1726364 0.0476742 -0.3339755 0.3644758 0.0540626 -0.0598274 0.0982146 0.1830424 -0.03101 0.0096046 -0.0374685 0.2937872 -0.0455406 -0.0755115 -0.0240635 -0.0879578 -0.0422615 -0.0310562 -0.0211112 -0.0522047 0.0357591 -0.0215383 -0.0215291 -0.0191149 -0.0501773 0.0706456 0.0239691 0.0482492 -0.02215 -0.2492757 -0.0088847 0.0680836 -0.0016384 0.057826 -0.1564916 0.0217096 0.0057313 0.0536854 0.0853509 0.1001187 -0.0085448 -0.019564 -0.0077279 0.0754362 0.0233639 -0.0684537 -0.0024814 -0.1619137 0.0797077 0.1097983 -0.0260899 0.0472657 -0.1114948 0.0272761 -0.0319348 0.0351301 0.0841901 -0.1401847 -0.0125834 0.0982029 0.0045095 0.0962263 -0.0193408 0.1176409 -0.0123982 0.0491374 0.0307393 -0.0353402 -0.0556744 -0.0618747 0.0270027 -0.0636772 -0.1434701 -0.1318005 0.2095076 0.3624445 0.0269694 -0.0215565 0.0355351 0.2672385 -0.079843 -0.033305 -0.0589279 0.0691197 unknown
polarizability: 37.7993515|-2.1119422|36.1259638|-0.9997006|1.5907153|30.0565828 unknown
InChI: InChI=1S/C2H7NO/c1-2-3-4/h3-4H,2H2,1H3
charge 0 multiplicity 1
11 atoms
O  1.497482 -0.600102 0.152089
N  0.706412 0.587116 -0.344848
C  -0.606433 0.578734 0.365281
C  -1.518546 -0.537939 -0.162629
H  -0.478939 0.47901 1.46592
H  -1.054702 1.573038 0.16234
H  -1.651912 -0.444494 -1.25502
H  -1.077848 -1.52608 0.056426
H  -2.51149 -0.489551 0.319591
H  1.275704 1.384136 -0.001768
H  1.64537 -1.115466 -0.682882
