program: Gaussian 09
title: 000164715
version: EM64L-G09RevD.01
frameworkgroup: C1[X(C15H13NO)]
method: RPBEPBE
basis: SDD
operation: Freq
keyword: #p
keyword: freq=noraman
keyword: PBEPBE/SDD
title: #p freq=noraman PBEPBE/SDD
converged: YES YES NO NO
title: Mulliken charges:
elementType: O N C C C C C C C C C C C C C C C H H H H H H H H H H H H H
charge: -0.197206 0.001493 -0.318557 -0.467791 -0.570102 0.384556 0.021743 0.118331 0.507734 -0.404948 -0.353485 -0.303841 -0.528008 -0.224943 -0.243021 -0.203721 -0.338589 0.235736 0.235476 0.228099 0.228751 0.237659 0.238365 0.281903 0.251111 0.243698 0.233253 0.237249 0.228475 0.240579
chargesum: 0.00000
title: Mulliken charges with hydrogens summed into heavy atoms:
elementType: O N C C C C C C C C C C C C C C C
charge: -0.197206 0.001493 -0.082821 -0.004216 -0.103692 0.384556 0.021743 0.118331 0.507734 -0.166583 -0.071582 -0.052730 -0.284310 0.008310 -0.005772 0.024755 -0.098010
polarizability: 2.41346529e+02 -5.58150590e+00 1.48097841e+02 -3.29910415e+00 -8.21678598e+00 1.02415115e+02
1716.lowfreq: -8.7188 -2.9933 -0.0004 -0.0001 0.0007 8.7792 28.5096 34.6006 77.3692
frequency: 28.4529 34.2631 77.3383 112.3765 146.8568 185.5342 231.7648 241.4401 266.1746 304.3004 374.5971 395.8860 420.9442 427.7645 480.2364 502.4010 524.8746 550.1424 594.3819 618.3616 641.0819 676.6791 722.4799 723.0109 753.6162 776.7796 802.9310 820.3385 829.4118 882.9252 897.9269 922.0867 934.3941 948.7683 978.8060 986.4059 1003.1835 1007.0317 1010.8889 1029.7988 1031.1857 1050.5502 1076.5773 1106.0796 1115.0191 1147.1475 1173.4038 1192.3257 1204.7099 1205.7595 1221.3380 1229.9176 1266.7764 1270.5949 1301.4222 1314.9627 1329.4991 1345.7386 1358.7889 1387.3770 1415.9881 1440.5149 1451.5664 1460.7214 1471.9158 1477.6689 1558.1640 1570.5973 1584.9387 1589.1265 1617.7124 2934.9052 2955.3728 2994.1056 3035.0060 3059.0243 3103.0050 3121.0580 3129.9285 3138.0473 3145.4872 3151.3477 3167.0432 3167.4475
redmass: 5.9807 4.9153 4.5740 4.8207 3.6224 3.3995 5.8941 4.0564 2.4850 5.0674 4.0882 3.1203 3.8886 3.8042 3.6591 4.6193 4.4204 4.6412 5.3489 6.3293 3.5552 5.6879 2.7305 2.4104 1.5893 2.3546 2.4140 2.5229 2.7712 1.8456 1.6259 1.3815 1.7641 2.0874 1.3895 1.4051 3.2881 1.3842 3.1606 2.4126 2.8986 2.3953 2.3592 1.9033 1.6708 1.3558 1.0721 1.4254 1.2767 2.0432 1.7133 1.9974 1.3127 1.7715 1.8558 4.1467 1.6082 1.3261 1.5313 6.9044 2.0865 2.3735 1.1860 2.1717 1.1880 1.9117 5.4844 8.6816 6.7565 6.4085 7.1739 1.0801 1.0669 1.0619 1.0927 1.1028 1.0910 1.0873 1.0881 1.0892 1.0916 1.0935 1.1002 1.1001
irintensity: 0.3349 2.4154 1.1140 3.5620 1.8957 1.0416 1.7799 0.2452 2.1993 6.8364 0.6928 2.6290 1.0757 2.6375 6.4405 0.3622 4.4833 7.0965 2.4919 13.2597 2.6930 1.4237 11.0276 23.0456 58.8845 8.5674 21.9539 17.6788 9.4654 19.8737 17.8935 2.7458 3.4801 8.3772 2.4280 0.5483 1.3349 0.4420 15.7772 2.9734 0.5484 2.5942 0.2619 12.3784 7.5007 2.4058 9.0177 7.9769 0.3062 0.5044 63.0270 65.2814 11.3842 3.6323 45.3033 4.4701 2.4466 2.8607 15.7079 4.5360 24.9292 23.8912 17.7902 20.4522 8.5467 12.5359 6.5799 86.0911 47.5299 35.7619 29.1018 16.7677 17.7561 28.0726 29.2444 25.9266 27.3288 5.6718 6.1459 11.8272 28.5029 9.7464 31.6179 17.9003
temp: 298.150 k
press: 1.00000 atm
elementType: 8 7 6 6 6 6 6 6 6 6 6 6 6 6 6 6 6 1 1 1 1 1 1 1 1 1 1 1 1 1
symmnumber: 1
zpe: 627659.7 jmol-1
zpe.correction: 0.239063 hartree
zpe.thermalcorrener: 0.252384 hartree
zpe.thermalcorrenthalpy: 0.253328 hartree
zpe.thermalcorrgfe: 0.197809 hartree
zpe.sumelectzpe: -708.190441 hartree
zpe.sumelectthermal: -708.177120 hartree
zpe.sumelectthermalent: -708.176175 hartree
zpe.sumelectthermalfe: -708.231695 hartree
dipole: -4.1420 2.2245 2.0790
dipole: 5.1407
quadrupole: -96.9181 -97.6393 -99.3065
quadrupole: -5.2043 8.2146 -2.6972
quadrupole: 1.0365 0.3153 -1.3518 -5.2043 8.2146 -2.6972
hfenergy: -708.4295037 hartree
pointgroup: C01 [X(C15H13N1O1)]
dipole: -1.6393758 1.0003973 0.6341609 debye
polarizability: 241.4316282|-5.4597939|143.6021822|-1.2042802|-15.8747779|106.8256743 unknown
InChI: InChI=1S/C15H13NO/c17-15-13-6-2-1-4-11(13)7-8-14(15)12-5-3-9-16-10-12/h1-6,9-10,14H,7-8H2
charge 0 multiplicity 1
30 atoms
O  0.040468 -1.944289 -0.044721
N  4.368959 0.410533 -0.831844
C  0.559479 0.427369 -0.437139
C  0.049543 1.706346 0.29467
C  -1.374236 2.068063 -0.172442
C  -2.335589 0.895636 -0.04618
C  -0.387959 -0.758804 -0.152128
C  -1.850352 -0.446835 -0.04028
C  2.021738 0.146306 -0.135175
C  -3.730272 1.114291 0.063646
C  -2.762414 -1.532472 0.070251
C  2.448474 -0.454195 1.076207
C  3.028058 0.550232 -1.048206
C  -4.63049 0.03242 0.167716
C  -4.145268 -1.299625 0.170066
C  3.829078 -0.611121 1.320792
C  4.75149 -0.163007 0.346819
H  0.462804 0.626518 -1.529091
H  0.744596 2.540621 0.08948
H  0.062293 1.532567 1.388486
H  -1.330828 2.389047 -1.235385
H  -1.760152 2.934648 0.395931
H  -4.111748 2.142539 0.072045
H  -2.351722 -2.547617 0.072909
H  1.71428 -0.813067 1.804653
H  2.749782 1.007102 -2.007674
H  -5.706155 0.223979 0.252354
H  -4.843177 -2.139651 0.250767
H  4.189211 -1.077571 2.243286
H  5.831708 -0.266062 0.501286
