program: Gaussian 09
title: 000164663
version: EM64L-G09RevD.01
frameworkgroup: C1[X(C8H13NO)]
method: RPBEPBE
basis: SDD
operation: Freq
keyword: #p
keyword: freq=noraman
keyword: PBEPBE/SDD
title: #p freq=noraman PBEPBE/SDD
converged: YES YES NO NO
title: Mulliken charges:
elementType: O N C C C C C C C C H H H H H H H H H H H H H
charge: -0.458194 -0.131538 -0.192494 -0.462718 -0.367785 -0.449582 0.422140 -0.397680 -0.423239 -0.486864 0.264035 0.230917 0.202270 0.173212 0.222454 0.221452 0.222216 0.225748 0.190661 0.242706 0.207959 0.198611 0.345713
chargesum: 0.00000
title: Mulliken charges with hydrogens summed into heavy atoms:
elementType: O N C C C C C C C C
charge: -0.112481 -0.131538 0.071541 -0.029531 0.027881 -0.005915 0.422140 0.018730 -0.180533 -0.080294
polarizability: 1.02571229e+02 5.95741947e+00 1.02313166e+02 -1.48447911e+00 2.74094903e+00 6.85227303e+01
1716.lowfreq: -6.8431 -0.0005 -0.0003 0.0002 8.0401 25.4723 55.5576 69.6784 152.8799
frequency: 54.6829 69.0598 152.8791 179.6630 217.1704 241.8914 271.9359 341.6221 427.0572 499.5944 526.6801 553.5277 618.6700 699.0755 776.0516 801.6338 850.9982 878.8634 907.0576 923.3383 935.6297 948.6193 981.3708 1000.6755 1005.6647 1037.2734 1088.6158 1110.2553 1128.6720 1137.4891 1148.3302 1167.5506 1190.3984 1193.7659 1218.5706 1230.5122 1247.4398 1277.7268 1291.0972 1306.2800 1317.1179 1342.7169 1350.9962 1401.0966 1462.4612 1465.2967 1470.8605 1478.1272 1504.7803 1674.3189 2870.2435 2903.5981 2921.3014 2953.2749 2973.1441 2986.0096 2990.0106 3000.1197 3015.8161 3068.0270 3080.9257 3152.1906 3559.1944
redmass: 4.2703 2.5393 3.8506 2.3660 1.6698 1.2982 2.2944 2.3298 3.3548 3.9793 3.0144 3.1391 3.1734 3.6697 2.4521 1.2877 2.2064 2.4438 1.5974 2.2853 4.1853 2.5370 1.9313 1.9364 1.6184 2.2143 2.0109 3.8079 1.7161 1.2830 1.3147 1.6601 1.2202 1.5259 1.3366 1.5095 1.2275 1.3498 1.3005 1.2915 1.4427 1.5634 2.1927 1.4487 1.0886 1.0921 1.0955 1.0852 1.0862 7.6434 1.0719 1.0671 1.0601 1.0922 1.0841 1.0989 1.0651 1.0753 1.0758 1.0999 1.1052 1.0965 1.0665
irintensity: 3.9251 0.0391 9.2892 11.2444 52.1133 92.2054 3.6419 7.8447 3.5560 5.5181 1.4356 5.9341 6.9821 5.0991 3.1285 37.6605 17.3402 1.3505 0.9126 3.4276 59.1934 8.2584 7.6265 1.7636 0.3398 3.2704 6.7509 10.2034 22.7523 1.2593 38.1352 44.3691 3.3992 6.6799 5.2907 7.2903 4.8735 3.6620 6.5322 2.9949 7.0150 0.1760 2.2819 10.0789 11.9558 3.3314 5.9791 4.9887 4.0290 2.9518 94.9114 92.9388 62.2751 59.6612 25.0849 61.2445 34.1111 21.7817 85.5906 29.9060 56.9295 17.8285 3.0361
temp: 298.150 k
press: 1.00000 atm
elementType: 8 7 6 6 6 6 6 6 6 6 1 1 1 1 1 1 1 1 1 1 1 1 1
symmnumber: 1
zpe: 517857.5 jmol-1
zpe.correction: 0.197242 hartree
zpe.thermalcorrener: 0.206888 hartree
zpe.thermalcorrenthalpy: 0.207832 hartree
zpe.thermalcorrgfe: 0.162032 hartree
zpe.sumelectzpe: -441.788550 hartree
zpe.sumelectthermal: -441.778904 hartree
zpe.sumelectthermalent: -441.777960 hartree
zpe.sumelectthermalfe: -441.823759 hartree
dipole: -0.8988 -0.6359 2.8537
dipole: 3.0587
quadrupole: -52.8666 -56.1610 -64.3363
quadrupole: 2.0989 -3.3962 0.7789
quadrupole: 4.9214 1.6270 -6.5483 2.0989 -3.3962 0.7789
hfenergy: -441.9857918 hartree
pointgroup: C01 [X(C8H13N1O1)]
dipole: 0.3641884 0.3112724 1.103922 debye
dipolederiv: -0.5095515 0.0238374 0.2567943 0.0585811 -0.5283842 0.1482979 0.3468676 0.2226938 -0.5021466 -0.6094627 0.0153976 0.0338855 0.1133909 -0.562985 -0.0389485 -0.0203995 0.0101515 -0.4603059 0.2253338 0.1172926 -0.0819664 0.1051091 0.1936998 -0.0259479 -0.0924439 -0.0182882 0.2596687 -0.0622563 0.0750854 -0.0126951 -0.0045495 0.0227059 -0.1098648 0.0093642 -0.0094903 0.0940876 0.5609342 -0.0742767 -0.0619594 -0.1213058 0.1169236 0.0284913 -0.1322548 -0.0139152 0.3923993 0.0378329 -0.0281185 -0.0389174 0.004854 -0.0145863 -0.0035685 0.010458 -0.0479748 0.1782228 -0.0488943 -0.1105738 0.062522 -0.0960782 0.0729664 -0.0358766 0.0973771 -0.1077055 -0.1299341 0.1189543 -0.0995427 -0.0444913 -0.1586508 0.412308 0.0388281 -0.0383206 -0.0570125 0.3523605 0.0070643 0.0637205 0.0904796 0.0875703 -0.0088687 -0.0903419 0.0753153 -0.0012446 -0.2147144 0.5155906 0.1710938 -0.1774387 0.118705 0.4823816 -0.1209757 -0.2610748 -0.1462272 0.4962882 0.010197 0.0027505 0.0378449 -0.0476875 -0.0346704 0.067121 0.064602 0.0825363 -0.0965542 0.0283014 -0.1010024 0.0122123 -0.0842662 -0.140337 0.0216228 0.0238721 0.047522 0.0661928 0.02917 0.0016073 -0.0419424 0.0193971 0.0616906 0.0602351 -0.0547782 -0.003894 -0.1598406 -0.024492 0.0408311 0.0162669 -0.0184423 -0.0175034 0.1069787 0.1499349 0.0632122 -0.2376643 -0.2164111 -0.0326551 -0.0672447 -0.0674042 0.0274501 -0.0303157 -0.1085745 -0.0404506 0.001181 -0.0562376 0.1091961 0.0808822 0.086357 0.0081513 -0.0566112 0.1213794 -0.1000329 -0.0141363 0.0426357 -0.0059602 -0.0308971 0.0153475 0.018101 0.0646758 -0.0791585 0.1127129 -0.1174825 0.0157362 -0.0146065 0.0012183 0.0372328 -0.1746426 -0.1035506 -0.0294465 -0.1671983 -0.0282803 -0.0690726 -0.1229125 0.1176141 -0.0007726 0.0071735 0.04688 0.1036781 0.1370256 -0.0982475 -0.0283737 0.0973725 -0.0819126 0.0777757 0.0076394 0.0580521 -0.0965676 0.0748083 0.1373209 -0.1113633 0.0739497 -0.0528494 0.1166073 -0.0657837 0.1269581 -0.0287563 0.0832669 -0.0277686 0.0163225 -0.0281921 0.0690213 -0.0579988 -0.1288341 -0.1267363 0.0664236 -0.0656743 -0.1221961 0.1280423 -0.174294 -0.0864271 -0.183772 0.2454041 -0.0254033 -0.1274972 -0.0548211 0.2315494 unknown
polarizability: 102.1993308|5.9419685|102.4181561|0.7306844|-4.2861497|68.7896388 unknown
InChI: InChI=1S/C8H13NO/c10-6-7-3-5-9-4-1-2-8(7)9/h3,8,10H,1-2,4-6H2
charge 0 multiplicity 1
23 atoms
O  2.918543 0.940458 -0.740297
N  -1.144174 -0.640885 -0.523833
C  -0.046108 0.397232 -0.421723
C  -0.658948 1.567365 0.40532
C  -2.389396 -0.098639 0.084146
C  -2.172398 1.434952 0.09533
C  1.119315 -0.355941 0.20554
C  -0.643204 -1.944548 -0.001117
C  0.785435 -1.652959 0.432327
C  2.428343 0.311944 0.509685
H  0.24272 0.769319 -1.4245
H  -0.242636 2.549285 0.122558
H  -0.480134 1.408398 1.486883
H  -2.530252 -0.471012 1.129537
H  -3.287238 -0.38621 -0.4949
H  -2.815542 1.942729 0.835035
H  -2.393573 1.855928 -0.902876
H  -0.672591 -2.740872 -0.774749
H  -1.267569 -2.305414 0.850055
H  1.445779 -2.417639 0.854597
H  3.159143 -0.429923 0.893635
H  2.279173 1.095003 1.287414
H  3.703215 1.507226 -0.528067
