program: Gaussian 09
title: 000164634
version: EM64L-G09RevD.01
frameworkgroup: C1[X(C13H10O)]
method: RPBEPBE
basis: SDD
operation: Freq
keyword: #pfreq=noraman
keyword: PBEPBE/SDD
title: #p freq=noraman PBEPBE/SDD
converged: YES YES NO NO
title: Mulliken charges:
elementType: O C C C C C C C C C C C C C H H H H H H H H H H
charge: -0.222031 0.437832 -0.582776 -0.376958 -0.391108 -0.232663 -0.228828 -0.240163 0.085220 0.224495 -0.378531 -0.260853 -0.113049 -0.172564 0.255926 0.253829 0.228316 0.249855 0.226105 0.226416 0.228369 0.267374 0.254150 0.261638
chargesum: 0.00000
title: Mulliken charges with hydrogens summed into heavy atoms:
elementType: O C C C C C C C C C C C C C
charge: -0.222031 0.437832 -0.073021 -0.148643 -0.141253 -0.006558 -0.002412 -0.011794 0.085220 0.224495 -0.111157 -0.006703 -0.113049 0.089073
polarizability: 2.36879845e+02 2.18024053e+01 1.16037996e+02 2.82833887e+00 2.11696951e-01 8.42595179e+01
1716.lowfreq: -11.8940 -9.7217 -2.0978 -0.0010 -0.0007 -0.0007 6.0760 19.2737 36.7601
frequency: -4.6800 17.9227 36.5906 89.9295 137.2497 186.5388 252.5404 293.1147 310.6033 403.8819 429.6571 458.4159 505.3127 525.5970 585.2806 612.3928 618.9770 647.9191 702.1331 733.2047 735.2787 780.3165 819.1787 855.8717 863.6027 870.2600 880.5919 886.8062 953.1265 959.0957 979.7740 990.7658 998.0872 1016.1377 1027.2544 1056.7882 1082.0070 1134.0161 1172.1518 1180.1275 1188.3406 1194.4022 1205.4257 1250.5589 1282.9362 1332.0290 1357.4942 1384.9840 1435.0665 1440.9469 1475.9445 1484.0760 1570.9985 1595.7215 1615.6338 2267.3882 2958.7236 3001.3299 3110.9857 3125.8819 3138.1378 3149.4127 3163.8202 3220.5898 3237.6780 3265.5183
redmass: 4.4549 3.8045 5.4614 4.1175 5.9770 2.7287 5.0388 3.8207 7.3980 2.8251 8.7552 2.8696 7.5132 5.6494 3.0915 6.5152 6.6190 4.7072 2.4067 1.3254 1.2673 4.8862 1.3244 1.2497 4.8646 6.5213 1.3591 1.4757 1.7757 3.3558 1.3798 6.1008 1.3245 1.9604 2.2230 2.5271 1.6029 1.5913 1.0532 2.4434 1.1229 1.9998 1.0877 1.7650 2.3863 1.3286 2.5819 7.5882 1.3234 1.6358 5.1292 2.3004 7.1461 6.1779 5.9839 11.8862 1.0588 1.0981 1.0878 1.0861 1.0915 1.0954 1.1014 1.0910 1.0992 1.1084
irintensity: 0.4960 0.0250 0.7418 4.3479 3.3072 5.8810 1.1211 1.8058 0.1032 0.0360 1.5057 9.6384 0.5991 2.7890 8.7350 1.4860 1.5556 0.1459 23.6569 79.4139 86.3506 0.2495 33.0541 0.0040 12.1089 6.4835 0.0191 2.0341 11.0890 12.3530 0.1453 0.9422 0.7362 17.3637 14.1088 7.1732 7.9351 11.6046 0.0758 17.1148 5.0227 2.3846 0.1391 2.6823 9.1839 1.1845 0.8095 2.1950 15.8173 16.6930 15.0139 25.6196 15.6629 0.6807 19.5368 3.8586 14.5454 5.6989 10.2306 0.2449 18.5408 33.3255 25.2418 5.9536 0.0657 0.1129
temp: 298.150 k
press: 1.00000 atm
elementType: 8 6 6 6 6 6 6 6 6 6 6 6 6 6 1 1 1 1 1 1 1 1 1 1
symmnumber: 1
zpe: 485938.2 jmol-1
zpe.correction: 0.185084 hartree
zpe.thermalcorrener: 0.196173 hartree
zpe.thermalcorrenthalpy: 0.197117 hartree
zpe.thermalcorrgfe: 0.145707 hartree
zpe.sumelectzpe: -575.561421 hartree
zpe.sumelectthermal: -575.550332 hartree
zpe.sumelectthermalent: -575.549388 hartree
zpe.sumelectthermalfe: -575.600798 hartree
dipole: 0.0430 -0.2492 0.8949
dipole: 0.9300
quadrupole: -63.1117 -75.4082 -82.3895
quadrupole: 5.7799 2.3138 -0.3032
quadrupole: 10.5247 -1.7717 -8.7530 5.7799 2.3138 -0.3032
hfenergy: -575.7465052 hartree
pointgroup: C01 [X(C13H10O1)]
dipole: 0.0437861 0.1468774 -0.3322246 debye
dipolederiv: -0.3010215 0.0220548 0.2186593 0.0552347 -0.1503312 0.009905 0.0719351 0.0705876 -0.5222694 0.257709 0.1734398 0.0497248 0.4105501 0.0733196 0.0397937 0.1048689 0.0333266 -0.0245076 0.2256872 -0.0085396 -0.0006222 -0.1231253 0.0644539 -0.0270622 -0.0312752 -0.0278476 0.1551778 -0.2140135 -0.0710437 -0.0136702 -0.1726657 0.0914419 0.0417638 -0.0320413 0.0454399 -0.1650306 -0.0637087 -0.077116 -0.0077813 -0.1674722 -0.1176487 -0.0052677 -0.0256333 -0.0025456 -0.139868 0.0742066 -0.0463544 0.0057204 -0.0483771 -0.0117784 0.02174 0.0027533 0.0223719 -0.1471617 -0.032168 -0.0192355 0.0036345 0.0023711 0.1310398 0.0512677 0.0075174 0.0495261 -0.142352 -0.0134307 0.0815516 0.0245376 0.0740638 -0.0240685 0.0313808 0.0218863 0.0312585 -0.1631728 0.0021578 -0.0753097 -0.002552 -0.1706401 -0.1230746 -0.0245202 -0.0489807 -0.0106673 -0.0575957 0.4578118 -0.1021644 -0.0690736 -0.2140035 0.1348452 -0.0622957 0.1322899 -0.1281276 0.4253654 -0.0346265 -0.0819842 0.0614433 -0.0843338 -0.1424643 -0.0643633 0.0638977 -0.065846 -0.0496149 -0.0730144 -0.0644326 -0.0319173 -0.0228332 -0.1942372 -0.0026876 -0.1518966 0.0276766 -0.1380469 -0.1447446 -0.0178448 -0.0295285 0.0540595 -0.0519534 0.0454404 0.0374627 0.0276273 -0.1936814 -0.1336278 0.0036409 -0.1918613 0.0377013 -0.1208869 -0.0141084 -0.1402948 -0.0334219 0.2392097 -0.0936437 0.0170771 0.022128 0.0281696 0.0530784 -0.0739983 -0.0056596 -0.0997696 -0.0274705 -0.0896156 0.021713 -0.0228158 0.0216046 -0.0263866 0.0784411 0.007557 0.1062914 0.0484402 0.1072836 -0.0014025 -0.0027449 0.0332728 -0.1227681 -0.0478619 0.0042618 -0.0489941 0.1399694 0.0011409 0.0671549 0.0029965 0.1504483 0.0647594 -0.008302 0.0163567 -0.0109427 0.143624 -0.132258 0.0775635 -0.0017929 0.0739823 0.055249 -0.0140535 -0.0038035 -0.013943 0.154592 0.0692933 0.0318268 0.0011382 -0.0063673 -0.1140964 -0.0488334 -0.0053279 -0.0471397 0.1466123 -0.0709122 -0.0999808 -0.0313237 -0.1118221 0.0144924 -0.0333653 -0.0340127 -0.0329857 0.1552521 0.1405288 0.0366344 -0.0290535 0.0368655 0.1664668 0.0592789 -0.0367176 0.0595482 0.0066377 -0.0160383 0.0716193 0.0613128 0.0761455 0.1728214 -0.0013878 0.068485 -0.0048291 0.1052909 0.0770047 0.061132 -0.016558 0.0671711 0.1777266 0.0490961 -0.0236285 0.0534058 0.0506 unknown
polarizability: 233.9060375|-28.8926545|118.4606425|2.1878683|3.6309968|84.810679 unknown
InChI: InChI=1S/C13H10O/c1-2-6-12(7-3-1)8-4-9-13-10-5-11-14-13/h1-3,5-7,10-11H,8H2
charge 0 multiplicity 1
24 atoms
O  3.321145 -0.500992 1.269472
C  -2.192769 0.709282 0.008028
C  -1.007877 1.656976 0.25485
C  -3.50575 1.245487 0.03033
C  -2.020686 -0.673302 -0.23435
C  -4.626487 0.41502 -0.18568
C  -3.142627 -1.507451 -0.45122
C  -4.448263 -0.96786 -0.427834
C  0.329869 1.054799 0.179345
C  2.770582 0.033593 0.064178
C  3.71088 -0.107302 -0.956615
C  4.87747 -0.740787 -0.391799
C  1.469597 0.577563 0.119737
C  4.605358 -0.96223 0.949256
H  -1.126736 2.123367 1.254829
H  -1.062023 2.493035 -0.472595
H  -3.652253 2.317422 0.217248
H  -1.008884 -1.093038 -0.25137
H  -5.634895 0.84364 -0.165717
H  -2.994874 -2.577317 -0.637298
H  -5.31666 -1.614603 -0.595804
H  3.569882 0.211242 -1.987312
H  5.797076 -0.998107 -0.913731
H  5.163124 -1.404737 1.770153
