program: Gaussian 09
title: 000164597
version: EM64L-G09RevD.01
frameworkgroup: C1[X(C12H12N2O4)]
method: RPBEPBE
basis: SDD
operation: Freq
keyword: #p
keyword: freq=noraman
keyword: PBEPBE/SDD
title: #p freq=noraman PBEPBE/SDD
converged: YES YES NO NO
title: Mulliken charges:
elementType: O O O O N N C C C C C C C C C C C C H H H H H H H H H H H H
charge: -0.190975 -0.192291 -0.214263 -0.433967 -0.379074 -0.376774 -0.056465 -0.429686 0.512726 0.160626 0.163232 -0.732677 -0.466102 -0.420429 0.160026 0.276322 -0.201576 -0.405323 0.241691 0.239620 0.232747 0.231139 0.228158 0.253065 0.253891 0.365946 0.365816 0.229092 0.225935 0.359570
chargesum: 0.00000
title: Mulliken charges with hydrogens summed into heavy atoms:
elementType: O O O O N N C C C C C C C C C C C C
charge: -0.190975 -0.192291 -0.214263 -0.074396 -0.013129 -0.010958 -0.056465 0.051625 0.512726 0.160626 0.163232 -0.040633 -0.213037 -0.166539 0.160026 0.276322 0.027516 -0.179388
polarizability: 1.74055595e+02 -1.01193449e+01 1.69459498e+02 -1.57034930e-01 4.72213516e-01 1.11868111e+02
1716.lowfreq: -12.9960 -5.1820 -0.0006 -0.0003 0.0004 5.9229 12.9926 38.8273 75.1792
frequency: 11.6686 38.7193 75.1748 114.9173 116.8576 141.6510 154.0447 174.4812 191.4738 222.7576 239.6233 241.4195 309.1326 309.7012 356.1634 357.9682 366.2866 412.2008 448.8180 457.7418 478.4123 513.2426 541.0265 565.6519 604.7679 633.8568 656.8348 671.9455 693.0437 699.3875 711.3620 755.1167 777.7009 785.8538 786.5981 832.5406 871.5900 880.3601 936.2519 948.8971 969.4921 971.1068 987.3505 991.8624 1076.7566 1088.0071 1128.2952 1139.7462 1140.4111 1157.5007 1187.7535 1206.2123 1256.5141 1286.0495 1300.3033 1312.0567 1331.7257 1362.5689 1376.3741 1378.3981 1389.2521 1396.6271 1451.1536 1461.1028 1477.6764 1478.8731 1484.1733 1594.4756 1618.6405 1623.4831 1657.4608 1676.8655 2983.1541 3019.7738 3067.6938 3083.3662 3095.1521 3122.4165 3151.3378 3154.5631 3186.6440 3516.4950 3518.3623 3586.7462
redmass: 5.2222 9.8705 5.9425 2.6474 4.7837 5.7543 6.6422 6.7811 1.2511 4.3018 3.8164 6.3987 3.1721 2.7437 2.0357 2.0344 8.4889 4.8157 3.0413 4.1754 9.7938 7.0454 6.6499 4.9649 7.9019 3.7844 2.5024 3.4677 5.0754 1.9601 5.0927 1.6501 1.4554 1.5008 1.6295 7.5850 1.4574 1.5466 2.8098 2.0558 1.3692 2.8693 5.1382 3.5200 2.8500 1.9477 2.6661 1.7523 2.1376 1.5843 1.1063 4.6974 3.1149 3.3679 1.2409 1.3547 1.5088 10.1696 2.0888 1.4295 6.2494 1.2538 1.2593 2.0882 2.1956 1.0832 1.0413 6.4655 7.1647 6.2867 8.7526 5.3911 1.0364 1.0594 1.1007 1.0980 1.1042 1.0888 1.0930 1.0916 1.0946 1.0757 1.0781 1.0661
irintensity: 0.4701 0.9330 2.1379 0.1581 1.6468 0.2131 7.1578 4.2058 0.8646 0.9276 2.9203 1.8630 3.2824 2.7654 21.4674 144.8515 11.9332 13.7011 4.0695 3.6063 14.8985 9.3797 7.2065 0.6082 0.8689 6.0905 1.1343 12.5476 14.1855 32.1823 8.1042 0.9051 19.8250 28.6823 246.6192 7.3383 2.5448 10.8998 50.5117 0.0929 0.0765 12.1044 1.4822 3.7818 4.3222 24.1461 5.6453 34.0672 8.9183 128.9998 9.2519 45.2994 26.9400 307.3271 14.1179 14.1419 45.9469 261.8609 2.6996 2.5921 5.4147 19.1684 18.4395 1.2449 53.3915 18.1590 16.3037 53.7290 310.0253 77.1398 59.9826 604.9232 24.7622 15.6625 8.1553 31.6928 17.4611 11.9838 18.1906 1.5810 5.8522 88.0504 45.1581 42.2883
temp: 298.150 k
press: 1.00000 atm
elementType: 8 8 8 8 7 7 6 6 6 6 6 6 6 6 6 6 6 6 1 1 1 1 1 1 1 1 1 1 1 1
symmnumber: 1
zpe: 595316.9 jmol-1
zpe.correction: 0.226744 hartree
zpe.thermalcorrener: 0.243045 hartree
zpe.thermalcorrenthalpy: 0.243989 hartree
zpe.thermalcorrgfe: 0.181951 hartree
zpe.sumelectzpe: -873.617274 hartree
zpe.sumelectthermal: -873.600974 hartree
zpe.sumelectthermalent: -873.600029 hartree
zpe.sumelectthermalfe: -873.662067 hartree
dipole: 2.7696 -1.1879 -0.0357
dipole: 3.0138
quadrupole: -84.7416 -107.6154 -116.9331
quadrupole: 6.2875 -0.2701 -0.0006
quadrupole: 18.3551 -4.5187 -13.8364 6.2875 -0.2701 -0.0006
hfenergy: -873.8440181 hartree
pointgroup: C01 [X(C12H12N2O4)]
dipole: -1.1287918 -0.362761 0.0126204 debye
polarizability: 175.912529|9.5129151|167.5983883|-0.3264459|0.5445712|111.872287 unknown
InChI: InChI=1S/C12H12N2O4/c1-2-12(7-4-3-5-8(15)6-7)9(16)13-11(18)14-10(12)17/h3-6,13-15H,2H2,1H3
charge 0 multiplicity 1
30 atoms
O  0.946631 -0.668165 -2.456193
O  0.957999 -0.83871 2.40188
O  2.950604 2.660503 0.088141
O  -3.042746 2.562723 0.031896
N  1.870486 0.99798 -1.150424
N  1.871953 0.91803 1.212919
C  0.555019 -0.837969 -0.029324
C  0.848305 -2.368497 -0.083331
C  -0.969832 -0.503625 -0.009735
C  1.130925 -0.190247 -1.310159
C  1.137131 -0.281097 1.291559
C  2.352457 -2.709433 -0.110851
C  -1.3687 0.854532 0.000043
C  -1.95743 -1.518232 0.005423
C  2.273022 1.604427 0.05303
C  -2.738272 1.191582 0.023861
C  -3.325091 -1.167998 0.029036
C  -3.730311 0.182864 0.038771
H  0.361249 -2.771181 -0.988491
H  0.384275 -2.829326 0.806062
H  2.852004 -2.29346 -1.004675
H  2.873397 -2.34034 0.791461
H  2.487391 -3.804892 -0.141011
H  -0.646571 1.677544 -0.011973
H  -1.677397 -2.573227 -0.001324
H  2.191412 1.461483 -2.007262
H  2.192881 1.322783 2.098959
H  -4.084574 -1.9569 0.040319
H  -4.795874 0.444675 0.057519
H  -4.020641 2.710274 0.048876
