program: Gaussian 09
title: 000013400
version: EM64L-G09RevD.01
frameworkgroup: C1[X(C8H12O2)]
method: RPBEPBE
basis: SDD
operation: Freq
keyword: #pfreq=noraman
keyword: PBEPBE/SDD
title: #p freq=noraman PBEPBE/SDD
converged: YES YES NO NO
title: Mulliken charges:
elementType: O O C C C C C C C C H H H H H H H H H H H H
charge: -0.199087 -0.200255 -0.246007 -0.431469 -0.408311 -0.392985 -0.510239 0.188477 0.201353 -0.777667 0.238255 0.233475 0.234905 0.190436 0.222749 0.217360 0.217155 0.218055 0.248448 0.284109 0.222393 0.248850
chargesum: 0.00000
title: Mulliken charges with hydrogens summed into heavy atoms:
elementType: O O C C C C C C C C
charge: -0.199087 -0.200255 -0.007752 0.036911 0.004873 0.041530 -0.043736 0.188477 0.201353 -0.022314
polarizability: 9.95493746e+01 2.23171364e+00 8.89071586e+01 -2.27094775e+00 1.85904300e+00 7.06318489e+01
1716.lowfreq: -17.9355 -0.0004 0.0002 0.0005 3.5386 20.6088 44.5485 72.6411 124.6318
frequency: 44.1097 72.5850 124.6242 139.7823 195.8702 233.7248 295.0516 300.2015 396.5606 408.5838 459.5976 471.2629 543.5879 605.8569 648.9595 725.3517 813.9412 829.8544 851.9400 885.9063 917.7152 962.7655 973.9369 1016.1939 1037.1435 1076.8785 1084.0033 1108.2986 1118.9348 1170.9567 1205.4415 1228.4223 1246.8851 1267.2161 1272.5302 1301.8579 1335.9350 1339.6699 1344.9706 1365.7494 1444.1017 1448.3050 1452.1252 1464.2433 1467.5514 1475.3174 1622.4980 1630.9782 2942.4913 2970.6755 2971.9104 2980.2613 2987.7297 3007.9949 3039.8795 3050.8401 3066.8286 3071.1633 3076.0699 3121.5791
redmass: 3.6221 4.9997 2.7794 1.1945 2.9755 3.0472 2.0322 3.7996 2.7051 3.3578 3.0788 2.4893 3.6967 3.4653 2.9582 2.3501 2.6608 1.6970 2.3319 1.4394 2.6654 1.4673 2.5876 2.0096 1.3909 2.1274 1.2797 2.5424 2.4559 1.5938 1.6303 1.7003 1.4274 1.4195 1.5610 1.3300 1.5096 1.4267 1.4761 1.2519 1.0915 1.0652 1.0670 1.0850 1.0848 1.0887 9.2166 8.6235 1.0795 1.0644 1.0649 1.0368 1.0614 1.0630 1.0949 1.1022 1.0961 1.1027 1.0974 1.1003
irintensity: 2.4293 4.6695 1.3208 0.6769 8.1156 0.8028 0.2648 0.3613 2.1590 0.2220 1.0822 0.8772 22.8412 3.6067 4.8349 2.5746 4.9025 5.0937 4.6393 7.8793 6.8872 5.6483 4.4449 4.4870 7.6063 4.4378 9.0556 3.6777 35.6968 27.7690 7.2507 17.8298 40.4298 47.3086 34.3671 23.3261 11.7047 0.6933 1.8000 87.0620 12.3409 20.3579 35.8860 14.0077 13.3186 5.5002 158.1593 100.9632 5.2922 35.2498 12.3479 8.7323 33.0483 11.8389 47.0385 43.9307 8.4265 26.5415 26.3777 12.7629
temp: 298.150 k
press: 1.00000 atm
elementType: 8 8 6 6 6 6 6 6 6 6 1 1 1 1 1 1 1 1 1 1 1 1
symmnumber: 1
zpe: 482785.3 jmol-1
zpe.correction: 0.183883 hartree
zpe.thermalcorrener: 0.194075 hartree
zpe.thermalcorrenthalpy: 0.195019 hartree
zpe.thermalcorrgfe: 0.147900 hartree
zpe.sumelectzpe: -461.715252 hartree
zpe.sumelectthermal: -461.705060 hartree
zpe.sumelectthermalent: -461.704116 hartree
zpe.sumelectthermalfe: -461.751235 hartree
dipole: -3.0846 -0.0345 3.1544
dipole: 4.4121
quadrupole: -58.9596 -67.2814 -59.8748
quadrupole: 3.7804 4.6191 0.9111
quadrupole: 3.0790 -5.2428 2.1638 3.7804 4.6191 0.9111
hfenergy: -461.899135 hartree
pointgroup: C01 [X(C8H12O2)]
dipole: 1.2617264 0.3724373 1.132462 debye
dipolederiv: -0.6473423 -0.1868942 -0.0374445 -0.166207 -0.8171239 -0.0460092 -0.1021649 -0.1873138 -0.269958 -0.6704352 0.0956911 -0.0797445 0.0332556 -0.4730723 0.2506598 -0.1494284 0.3156737 -0.6216533 -0.5747625 0.162044 -0.0709682 0.15903 -0.4245886 0.1030395 -0.0799881 0.1001898 0.0750235 0.0375142 0.1054209 -0.0073525 0.0398542 0.1264005 0.0027187 -0.0468239 -0.0674551 0.1251911 0.0326326 0.0046158 0.0036333 -0.0222619 0.0466384 0.0271979 0.04902 0.0539966 0.1450378 0.1380627 0.039357 0.0019654 0.1153075 0.099834 0.0140091 -0.0858355 -0.0127299 0.1520902 -0.3998354 -0.0685024 -0.0557393 -0.0063619 -0.0513457 0.0476397 -0.0478145 0.0468219 0.0793772 0.9523617 0.0122913 0.1612757 -0.1728335 1.1197888 0.0690589 0.2422225 0.2321255 0.0700507 1.1705632 -0.037415 -0.0120558 0.1099646 0.331219 -0.4309994 0.127005 -0.482014 0.6474157 -0.2694548 -0.1606727 0.1797159 -0.1495536 -0.2218303 0.2043106 0.1647042 0.1580842 -0.1416682 0.0677117 0.0123344 -0.030197 -0.0231796 0.0804224 -0.0268101 -0.0023572 -0.025259 -0.0931016 0.0201917 0.0706261 0.0088675 0.0650218 -0.1264137 -0.0020561 0.0237153 -0.004545 0.0752807 0.0560966 -0.0202639 -0.012703 -0.0387788 0.0582247 -0.069298 -0.005871 -0.0258007 -0.0958164 0.0383836 0.0224462 -0.0096127 0.0238526 0.030775 -0.0532143 -0.063648 -0.1138206 -0.1622901 -0.0449915 -0.0893144 0.0674786 -0.0910093 -0.0548427 0.0852076 0.089135 0.1071905 0.0090894 -0.2116003 0.0210964 -0.0386461 -0.0068314 0.044644 0.0149097 -0.0624685 0.0204196 0.0661926 0.0869311 -0.0244674 -0.027754 -0.0074711 0.0088856 -0.0469663 0.0454344 -0.0554752 -0.1445353 0.0521398 -0.0051113 0.0099133 0.0070882 0.090315 -0.0847121 -0.0043889 -0.0338531 -0.1065108 0.013395 0.0331353 -0.0017237 0.074704 -0.1243157 0.011521 0.0115491 -0.01427 0.0878466 0.1937884 0.0341513 0.0220215 -0.0039907 0.0268446 -0.0213837 -0.0321098 -0.0295074 0.1152057 0.0740578 -0.0463849 -0.0713381 -0.0101502 0.1186466 -0.0657293 -0.0354257 -0.0182838 -0.0964391 -0.1154083 0.0258163 0.0004082 0.0705504 0.1108945 0.0169061 -0.0344612 0.0358257 0.0841717 unknown
polarizability: 99.7166198|2.3128902|85.9640417|0.4118592|-6.9876369|73.4077206 unknown
InChI: InChI=1S/C8H12O2/c1-6(9)7-4-2-3-5-8(7)10/h7H,2-5H2,1H3
charge 0 multiplicity 1
22 atoms
O  -0.42896 -1.855048 0.020189
O  -2.237873 1.328382 -0.934343
C  -0.337378 0.590084 0.402687
C  0.518962 1.546948 -0.481364
C  2.013409 1.493475 -0.101375
C  2.568839 0.05671 -0.217078
C  1.740141 -0.932887 0.651196
C  0.249498 -0.842439 0.33534
C  -1.839159 0.655259 0.052446
C  -2.795875 -0.116593 0.941464
H  -0.225051 0.909624 1.463655
H  0.117716 2.571026 -0.380778
H  0.380795 1.266357 -1.542239
H  2.150184 1.859618 0.937463
H  2.588181 2.17404 -0.757599
H  3.628401 0.017577 0.097377
H  2.532337 -0.270897 -1.274663
H  1.884062 -0.670802 1.720446
H  2.066865 -1.976796 0.506458
H  -2.648805 -1.196557 0.748505
H  -2.583243 0.055591 2.013004
H  -3.836645 0.160427 0.713308
