program: Gaussian 09
title: 000164505
version: EM64L-G09RevD.01
frameworkgroup: C1[X(C20H20N2O2)]
method: RPBEPBE
basis: SDD
operation: Freq
keyword: #p
keyword: freq=noraman
keyword: PBEPBE/SDD
title: #p freq=noraman PBEPBE/SDD
converged: YES YES NO NO
title: Mulliken charges:
elementType: O O N N C C C C C C C C C C C C C C C C C C C C H H H H H H H H H H H H H H H H H H H H
charge: -0.432752 -0.438250 -0.654907 -0.651217 0.049892 -0.251072 0.404243 0.315715 0.441418 -0.356692 -0.321150 -0.379579 -0.379306 -0.498809 -0.354085 -0.410314 -0.426870 -0.393949 -0.360207 0.286531 0.280207 -0.235096 -0.238267 -0.241220 0.180090 0.290601 0.297320 0.278310 0.292865 0.265258 0.282551 0.246954 0.280858 0.243320 0.278057 0.220580 0.214637 0.250788 0.244073 0.224320 0.223974 0.227054 0.354780 0.349347
chargesum: 0.00000
title: Mulliken charges with hydrogens summed into heavy atoms:
elementType: O O N N C C C C C C C C C C C C C C C C C C C C
charge: -0.077973 -0.088903 -0.066987 -0.080042 0.049892 -0.070983 0.404243 0.315715 0.441418 -0.091434 -0.038600 -0.132625 -0.098448 -0.255489 -0.076027 -0.189734 -0.212233 -0.143161 -0.116135 0.286531 0.280207 -0.010776 -0.014293 -0.014166
polarizability: 2.95185399e+02 -1.11077857e+01 2.41455221e+02 -1.18344682e+01 -1.54094771e+01 1.66983803e+02
1716.lowfreq: -9.4010 -4.1179 -0.0007 -0.0005 0.0002 6.5350 18.4286 30.5393 44.2356
frequency: 16.8619 30.4434 44.1965 49.3037 64.8878 75.4057 103.6518 134.6792 171.5261 179.1153 225.3334 233.7411 237.0057 245.7478 264.7749 272.5819 302.2187 346.1054 351.0180 354.1630 363.7252 372.1530 391.6501 400.4894 409.8899 411.8483 415.6158 419.6588 475.0934 497.0694 529.3769 543.8772 565.4348 581.4688 609.4227 614.9099 623.8520 629.4776 635.0124 641.7335 699.8403 710.7008 733.5818 744.2972 763.7686 780.2112 802.8406 806.7610 811.7279 814.7692 835.5658 839.0951 858.7336 880.7464 918.9730 941.8467 943.9086 952.1660 964.3079 979.0463 986.1219 990.6569 996.3567 1003.5993 1006.6440 1024.5486 1067.7654 1069.4561 1097.0960 1105.5776 1110.0828 1127.2660 1142.4470 1144.6521 1151.7463 1170.6954 1180.0037 1183.1670 1185.9842 1193.7514 1237.6901 1243.0433 1252.5315 1254.2278 1304.4603 1310.4265 1314.3964 1328.1616 1355.7588 1381.2464 1385.5487 1395.1424 1417.6629 1420.5209 1442.7917 1480.1728 1497.1179 1501.2005 1589.2392 1591.7777 1594.2527 1610.3303 1620.6439 1622.5944 1627.3428 1629.4406 2853.7983 3104.8674 3109.0462 3113.2833 3124.8227 3129.1085 3138.3218 3153.2090 3156.7145 3164.7559 3168.6454 3168.9292 3173.7233 3174.3954 3437.1073 3444.9131 3574.3351 3580.3538 3581.8531 3582.2138
redmass: 3.9928 5.6746 4.1100 5.6102 4.9478 3.9851 5.1139 5.2486 5.4941 5.7506 4.0942 4.2767 3.6412 2.1769 4.7936 1.8733 1.7195 1.9366 1.1023 4.8876 1.1182 3.6032 4.2716 3.9025 2.9908 2.9077 3.0087 3.3921 3.7825 3.8931 3.0528 3.4823 3.2630 2.6018 2.7024 4.6542 2.3579 3.2199 6.1599 3.3992 2.5777 1.7299 3.6230 3.4293 2.5940 2.3892 1.8757 5.0837 3.3745 1.3417 1.6252 1.5375 1.2483 2.5119 1.7328 1.4617 1.7510 1.9849 1.3564 1.4221 1.3730 5.3254 1.3268 2.9405 2.8499 2.3041 2.8556 2.3145 2.1855 1.4821 1.5091 1.9560 1.5187 1.3669 1.5058 1.0606 1.2370 1.1168 1.2002 2.1392 1.8924 2.5646 2.1916 2.0777 1.3873 1.4117 1.3825 1.4723 1.8460 5.3822 6.0731 3.1750 3.0785 3.1817 2.0657 2.3178 2.6294 2.5966 6.1310 5.9164 6.3165 5.1119 2.4051 3.4149 1.7705 1.2175 1.0811 1.0900 1.0871 1.0900 1.0867 1.0879 1.0928 1.0877 1.0983 1.0934 1.0936 1.0945 1.0958 1.0956 1.0455 1.0447 1.0979 1.0659 1.0708 1.0921
irintensity: 0.7029 0.3741 0.7059 0.1426 0.3925 0.5839 0.0884 2.8323 0.6742 0.7097 1.0700 3.1692 4.2127 14.9990 6.7628 15.1301 17.4944 26.3178 142.2197 3.0438 144.8602 10.1384 8.4291 14.5342 2.3951 0.2256 0.4327 18.1048 7.8721 8.9767 16.3390 7.6937 47.3700 24.7682 53.5498 29.5796 152.7653 19.7060 4.5982 62.3842 48.8964 45.4386 14.4094 29.0599 27.5114 2.7871 21.7836 13.1579 48.1203 11.6529 41.8677 35.0299 0.3564 2.1337 3.9538 4.5454 7.6808 11.8138 1.2425 0.8657 0.5300 0.0603 0.9178 10.2980 8.7349 13.3586 19.0053 3.0426 9.4894 51.8066 38.8136 26.1840 121.9517 339.4053 27.0355 0.3769 13.2641 14.0236 8.5928 6.6228 0.2034 20.0198 11.3804 65.3253 22.3957 7.1078 0.6721 36.4906 7.9990 12.1979 18.2512 3.5352 10.6193 11.6447 14.4430 13.8246 107.6053 106.3679 17.1172 7.6158 8.2324 9.4866 68.7008 30.0562 23.7425 59.8052 89.3370 23.3096 10.7261 22.5322 1.4673 11.3253 28.7448 2.3270 36.2497 7.6665 3.4733 6.3965 10.0341 5.1368 0.5497 0.1225 1.9464 35.3286 29.8857 20.7043
temp: 298.150 k
press: 1.00000 atm
elementType: 8 8 7 7 6 6 6 6 6 6 6 6 6 6 6 6 6 6 6 6 6 6 6 6 1 1 1 1 1 1 1 1 1 1 1 1 1 1 1 1 1 1 1 1
symmnumber: 1
zpe: 926490.7 jmol-1
zpe.correction: 0.352882 hartree
zpe.thermalcorrener: 0.374541 hartree
zpe.thermalcorrenthalpy: 0.375485 hartree
zpe.thermalcorrgfe: 0.301842 hartree
zpe.sumelectzpe: -1032.346201 hartree
zpe.sumelectthermal: -1032.324541 hartree
zpe.sumelectthermalent: -1032.323597 hartree
zpe.sumelectthermalfe: -1032.397240 hartree
dipole: 0.9467 -0.7796 -1.7044
dipole: 2.0998
quadrupole: -133.9231 -130.6482 -136.1697
quadrupole: 11.3022 2.2906 -11.5291
quadrupole: -0.3428 2.9321 -2.5893 11.3022 2.2906 -11.5291
hfenergy: -1032.6990825 hartree
pointgroup: C01 [X(C20H20N2O2)]
dipole: 0.3600844 0.3395107 0.661459 debye
polarizability: 293.9140464|14.2636788|242.4385285|11.2584162|-16.0969881|167.2718471 unknown
InChI: InChI=1S/C20H20N2O2/c21-19(14-4-2-1-3-5-14)20(22,15-6-10-17(23)11-7-15)16-8-12-18(24)13-9-16/h1-13,19,23-24H,21-22H2
charge 0 multiplicity 1
44 atoms
O  6.118978 0.690269 0.146901
O  -1.855318 -4.825435 0.210175
N  0.143712 0.926276 -1.88513
N  -0.017829 1.364563 1.908642
C  0.345288 0.503819 -0.476106
C  -0.364994 1.585057 0.49318
C  1.879989 0.523302 -0.236668
C  -0.24056 -0.912223 -0.266899
C  -1.881918 1.626655 0.313842
C  2.656507 -0.651059 -0.396434
C  -0.179769 -1.557683 0.996726
C  2.573378 1.737039 0.030802
C  -0.828817 -1.622716 -1.343194
C  -2.462318 2.570793 -0.573234
C  -2.739333 0.741131 1.017683
C  4.061607 -0.628823 -0.274475
C  -0.709102 -2.851948 1.183929
C  3.976181 1.778191 0.158815
C  -1.364819 -2.916245 -1.173396
C  4.723322 0.589329 0.007101
C  -1.308454 -3.530873 0.095465
C  -3.861433 2.618226 -0.772298
C  -4.136924 0.790659 0.82526
C  -4.704257 1.723842 -0.074403
H  0.013692 2.564283 0.107087
H  0.836203 1.603305 -2.21616
H  -0.822447 1.195739 -2.105234
H  -0.557317 1.942168 2.560916
H  0.990563 1.396125 2.091969
H  2.154123 -1.596284 -0.620824
H  0.260511 -1.026444 1.844198
H  2.021494 2.677858 0.138653
H  -0.834307 -1.155949 -2.331945
H  -1.815678 3.291632 -1.09011
H  -2.299016 0.018248 1.709826
H  4.636102 -1.555629 -0.404342
H  -0.650254 -3.329354 2.171836
H  4.503124 2.713342 0.370358
H  -1.819868 -3.458775 -2.0077
H  -4.291163 3.355386 -1.460196
H  -4.785152 0.097075 1.373046
H  -5.789545 1.758714 -0.222947
H  6.549734 -0.190312 0.013199
H  -1.762315 -5.15957 1.136684
