program: Gaussian 09
title: 000164448
version: EM64L-G09RevD.01
frameworkgroup: C1[X(C9H16O4S2)]
method: RPBEPBE
basis: SDD
operation: Freq
keyword: #p
keyword: freq=noraman
keyword: PBEPBE/SDD
title: #p freq=noraman PBEPBE/SDD
converged: YES YES NO NO
title: Mulliken charges:
elementType: S S O O O O C C C C C C C C C H H H H H H H H H H H H H H H H
charge: 0.010466 0.055105 -0.247646 -0.232000 -0.394705 -0.247951 -0.036607 -0.412567 -0.292173 -0.711177 -0.707528 -0.619383 -0.618040 0.355204 0.332510 0.209466 0.220913 0.215540 0.244128 0.241753 0.217093 0.211181 0.215947 0.209221 0.216413 0.217938 0.344271 0.332679 0.157559 0.125986 0.386405
chargesum: 0.00000
title: Mulliken charges with hydrogens summed into heavy atoms:
elementType: S S O O O O C C C C C C C C C
charge: 0.168025 0.181091 -0.247646 -0.232000 -0.008300 -0.247951 0.172858 0.023886 0.193708 -0.066955 -0.063956 -0.275112 -0.285361 0.355204 0.332510
polarizability: 1.72818519e+02 1.31811126e+00 1.39548132e+02 5.17193587e+00 -3.13782567e+00 1.24955413e+02
1716.lowfreq: -9.7250 0.0018 0.0020 0.0024 4.9339 7.5989 19.1090 24.0276 42.2540
frequency: 18.2684 23.9582 42.1680 50.2078 80.8794 98.5608 102.3081 119.0038 139.8695 155.5965 169.7320 209.7007 215.8454 228.4182 238.4449 267.9646 300.3295 305.0333 339.0834 355.0946 356.3620 387.6970 458.0920 508.0553 550.3424 561.7446 570.1037 646.5851 668.1092 689.7205 712.3137 752.6656 774.8300 791.9225 829.5556 856.4870 897.5810 915.0799 936.0850 946.5458 951.9095 971.7016 986.4451 1022.2782 1053.7899 1093.2441 1135.9818 1145.1915 1147.7868 1192.9402 1208.0661 1210.0822 1222.9418 1262.3231 1280.9927 1283.4489 1290.9886 1332.8252 1338.1905 1368.3708 1380.1828 1381.0669 1399.7938 1462.6566 1465.1077 1478.6070 1481.0753 1485.9883 1491.0585 1612.2841 1629.9018 2285.3856 2319.8203 2969.5249 2971.0696 2974.2296 2992.8991 3015.3558 3043.6251 3062.6013 3069.5615 3070.6479 3074.1703 3080.5193 3086.4117 3088.1130 3518.5446
redmass: 3.9286 3.6035 6.7521 6.4030 5.9804 2.8772 4.2724 4.0061 6.8349 5.9116 7.7139 4.5812 1.2087 4.3244 1.1360 5.9544 6.7532 5.8807 2.8869 1.2033 2.0465 2.8126 1.1025 3.0198 3.8715 2.7401 2.6747 2.6029 3.3532 5.8399 3.3306 3.5710 1.1740 2.8909 2.6139 2.2288 3.1685 1.1933 1.9115 3.5098 1.2817 2.1958 1.7663 1.9390 3.7201 2.0903 2.1931 2.2061 1.7730 1.9327 1.1886 1.2124 1.2050 1.4109 1.1202 1.5358 1.8469 1.4631 1.3744 2.0422 1.4533 1.2222 1.2205 1.0887 1.0444 1.0558 1.0804 1.0514 1.0542 10.1087 7.8208 1.0396 1.0368 1.0797 1.0356 1.0365 1.0641 1.0567 1.1021 1.0998 1.0996 1.0990 1.0989 1.0847 1.0860 1.1079 1.0640
irintensity: 0.1933 0.0569 0.6639 1.3377 2.4191 0.5324 0.4693 2.3847 0.3952 2.8634 4.1814 6.8668 0.0473 3.3618 0.9276 0.4778 13.5084 21.2430 1.4459 7.1190 0.2966 0.6808 86.3933 56.1651 11.1508 21.8370 46.7386 115.1198 27.1583 21.1649 27.4009 3.5484 2.8825 5.8958 7.6584 34.3746 11.7392 2.3476 62.2683 37.2897 0.3769 16.4697 0.2372 15.3514 107.3734 203.5877 156.1989 157.0856 7.0791 8.0768 15.3005 3.6930 14.3924 4.0694 1.9606 5.0683 152.9586 1.9649 2.9552 55.8132 1.2043 21.4483 14.2487 6.1637 1.5106 3.3874 13.5802 11.6310 18.3126 193.8897 190.4421 69.9115 59.7520 15.3594 37.2481 18.3722 26.1519 18.8146 6.8690 21.1270 33.6439 61.3525 83.0264 0.8446 2.2054 35.2296 47.0278
temp: 298.150 k
press: 1.00000 atm
elementType: 16 16 8 8 8 8 6 6 6 6 6 6 6 6 6 1 1 1 1 1 1 1 1 1 1 1 1 1 1 1 1
symmnumber: 1
zpe: 626006.1 jmol-1
zpe.correction: 0.238433 hartree
zpe.thermalcorrener: 0.256974 hartree
zpe.thermalcorrenthalpy: 0.257918 hartree
zpe.thermalcorrgfe: 0.189192 hartree
zpe.sumelectzpe: -1448.370562 hartree
zpe.sumelectthermal: -1448.352021 hartree
zpe.sumelectthermalent: -1448.351077 hartree
zpe.sumelectthermalfe: -1448.419803 hartree
dipole: 2.6092 0.5389 -0.6746
dipole: 2.7483
quadrupole: -97.0525 -105.4671 -107.8082
quadrupole: -3.7197 -3.4411 1.0022
quadrupole: 6.3901 -2.0245 -4.3656 -3.7197 -3.4411 1.0022
hfenergy: -1448.6089948 hartree
pointgroup: C01 [X(C9H16O4S2)]
dipole: -1.0276759 -0.3356526 -0.0188047 debye
polarizability: 172.7938799|-3.1050675|134.5952081|-4.4783456|-7.578726|129.9329758 unknown
InChI: InChI=1S/C9H16O4S2/c1-5(2)3-4-13-9(12)7(15)6(14)8(10)11/h5-7,10,14-15H,3-4H2,1-2H3
charge 0 multiplicity 1
31 atoms
S  1.869089 2.114086 -0.865441
S  4.31063 -0.329578 -1.527273
O  -0.802709 0.09628 -0.797106
O  0.360533 -0.547597 1.120657
O  3.62826 -1.496191 1.668369
O  3.255534 0.787367 1.626153
C  -4.646295 0.137456 -0.496284
C  -3.204839 0.259178 -1.071541
C  -2.103501 -0.113197 -0.077951
C  -4.99726 -1.312608 -0.079395
C  -4.904773 1.128937 0.665413
C  1.58933 0.220743 -0.878168
C  2.804364 -0.596635 -0.395521
C  0.346599 -0.117334 -0.059288
C  3.21772 -0.327475 1.046264
H  -5.325939 0.417417 -1.327902
H  -3.032478 1.298623 -1.410897
H  -3.110203 -0.391666 -1.962308
H  -2.097226 0.527146 0.821639
H  -2.147842 -1.169019 0.242353
H  -6.067762 -1.393918 0.184293
H  -4.416263 -1.634034 0.805652
H  -4.794798 -2.02768 -0.898822
H  -4.31287 0.869107 1.563342
H  -5.970372 1.115275 0.959601
H  -4.646095 2.16451 0.375347
H  1.398277 0.000685 -1.940817
H  2.582544 -1.671682 -0.490974
H  2.38684 2.090812 0.434639
H  4.097567 1.050881 -1.583989
H  3.921838 -1.295291 2.598355
