program: Gaussian 09
title: 000164446
version: EM64L-G09RevD.01
frameworkgroup: C1[X(C9H12O4)]
method: RPBEPBE
basis: SDD
operation: Freq
keyword: #pfreq=noraman
keyword: PBEPBE/SDD
title: #p freq=noraman PBEPBE/SDD
converged: YES YES NO NO
title: Mulliken charges:
elementType: O O O O C C C C C C C C C H H H H H H H H H H H H
charge: -0.231884 -0.236932 -0.182586 -0.261336 -0.174586 0.408736 -0.510568 -0.118919 -0.670850 0.148325 -0.682576 0.165065 -0.501423 0.250203 0.259848 0.209320 0.254695 0.211510 0.239645 0.230367 0.258374 0.208781 0.243311 0.239208 0.244271
chargesum: 0.00000
title: Mulliken charges with hydrogens summed into heavy atoms:
elementType: O O O O C C C C C C C C C
charge: -0.231884 -0.236932 -0.182586 -0.261336 0.075617 0.408736 -0.041400 -0.118919 0.035000 0.148325 0.014947 0.165065 0.225368
polarizability: 1.45119532e+02 1.36670472e+01 1.16263313e+02 2.47773124e+00 2.00083742e+00 7.28784176e+01
1716.lowfreq: -8.5715 -0.0002 0.0004 0.0005 5.4239 9.3760 29.7968 62.4475 70.1472
frequency: 29.4782 62.3946 70.1239 95.1122 114.8355 119.0085 134.9102 172.6189 197.7714 214.1635 256.0638 282.1141 291.7701 318.7063 376.3207 401.3562 424.6093 542.8889 581.3510 631.8074 663.2758 697.2153 735.5397 767.8924 788.0330 839.6101 885.1358 905.4473 945.9420 960.3575 1023.9018 1047.5136 1056.9325 1087.5380 1104.8179 1111.5033 1118.8123 1151.4231 1205.0560 1258.7842 1274.9993 1287.8854 1297.5635 1326.6603 1385.2736 1389.1339 1422.1082 1452.9371 1459.4422 1461.2881 1462.1103 1471.9561 1475.6398 1485.2753 1594.9072 1629.7847 1711.3055 2991.4946 2993.2476 2999.3030 3003.2252 3005.6975 3069.5653 3090.3214 3100.3312 3107.1985 3110.3291 3112.9525 3156.6387
redmass: 4.8872 3.1404 2.8410 1.1688 4.7695 3.5388 3.5798 2.9595 1.1677 1.1616 3.7511 2.8920 3.2220 7.3410 6.1194 5.2439 3.9749 3.9279 7.0498 5.5139 8.6687 4.8450 4.9547 2.4898 2.2937 2.6711 4.0740 5.1519 3.4191 2.8634 1.5534 2.3632 2.0782 2.3183 2.8104 1.2762 2.5160 1.5724 2.0654 1.5315 1.6052 1.7047 1.3384 2.7127 1.2017 1.2333 1.2212 1.0505 1.0544 1.0962 1.0572 1.0451 1.0585 1.0698 8.8377 9.3159 13.0083 1.0384 1.0783 1.0400 1.0567 1.0299 1.0996 1.1005 1.0997 1.1045 1.1014 1.1014 1.1046
irintensity: 4.2516 1.5561 0.0897 0.3432 0.1517 2.0558 3.1883 3.1054 0.3712 0.5834 4.9563 6.3167 5.5425 10.5474 1.9116 3.7722 2.9795 2.5096 5.8322 9.3745 2.5707 5.1197 18.6794 9.7019 5.5889 8.9717 39.8838 66.0798 50.4871 63.1050 16.2433 11.4795 14.3261 32.7777 15.4176 1.1277 54.8548 51.2256 65.0207 30.7204 83.6082 63.3342 4.3664 12.0200 1.8392 26.4572 29.9733 15.2771 12.7418 8.3046 12.7053 6.6770 12.1477 16.3732 159.7037 107.3367 387.1466 20.8006 26.0358 4.0004 41.4099 28.8422 3.8864 30.5877 17.6703 25.2621 22.8947 16.0411 12.7623
temp: 298.150 k
press: 1.00000 atm
elementType: 8 8 8 8 6 6 6 6 6 6 6 6 6 1 1 1 1 1 1 1 1 1 1 1 1
symmnumber: 1
zpe: 514398.5 jmol-1
zpe.correction: 0.195924 hartree
zpe.thermalcorrener: 0.210084 hartree
zpe.thermalcorrenthalpy: 0.211028 hartree
zpe.thermalcorrgfe: 0.154062 hartree
zpe.sumelectzpe: -650.053399 hartree
zpe.sumelectthermal: -650.039239 hartree
zpe.sumelectthermalent: -650.038295 hartree
zpe.sumelectthermalfe: -650.095261 hartree
dipole: 2.0131 4.0042 1.5470
dipole: 4.7412
quadrupole: -58.5233 -92.0580 -74.8756
quadrupole: 2.5487 -0.4244 -3.8163
quadrupole: 16.6290 -16.9057 0.2767 2.5487 -0.4244 -3.8163
hfenergy: -650.249323 hartree
pointgroup: C01 [X(C9H12O4)]
dipole: -0.8166653 -1.5647728 0.6033279 debye
dipolederiv: -1.1143445 -0.0882297 0.1466256 0.0546321 -0.5414771 0.0595296 0.0759902 0.0739796 -0.3439339 -1.4056061 -0.257467 -0.1273405 -0.4405442 -0.5296212 -0.0770735 -0.1765532 -0.0605584 -0.2902201 -0.7335822 -0.2617118 0.1108143 -0.4058553 -0.898702 0.163182 0.1167163 0.1665835 -0.351049 -0.6988079 0.1394094 -0.040451 -0.0429241 -0.907297 -0.0525453 -0.0711396 -0.0166503 -0.3121267 0.1421908 0.1009412 -0.0358901 0.220089 0.2863417 -0.0469575 -0.0823662 -0.0094904 0.3480724 0.531144 0.2461394 -0.0347745 0.2985243 0.3902154 0.0450022 0.0675256 -0.100763 -0.1132883 0.1171001 0.012089 -0.0409067 -0.0918051 -0.2397419 -0.0591706 -0.1772733 -0.1713541 0.0070442 -0.7630239 -0.1143248 -0.0050849 -0.125754 -0.6106319 0.063278 0.0206512 0.1229499 -0.0474136 0.0164915 0.0042195 0.0723443 0.0492685 0.0233442 -0.0187161 -0.02813 0.0351176 -0.0132821 1.3873639 0.3253622 -0.1839484 0.2372217 1.397262 -0.263683 -0.1087884 -0.284002 0.3243667 0.0374755 -0.0361252 0.0224118 -0.0292326 0.0635903 -0.0196787 0.1343008 0.1492039 0.057658 1.8361123 0.0609867 0.1847493 0.3290334 1.1540428 0.1413175 0.2075961 0.0749971 0.2717978 0.7187882 0.0378204 0.0475849 -0.056823 0.2094567 -0.0096216 0.0694471 0.0016777 0.2814441 -0.0116311 -0.0616031 -0.04382 -0.033723 0.0311602 -0.0296349 -0.063358 -0.0518699 -0.0447672 0.0305098 0.0394613 -0.0895572 0.0168124 0.0419669 0.0185682 -0.0505734 0.0289582 0.0210806 -0.0916261 -0.0293284 0.1237062 -0.0101528 0.0606883 -0.0192867 0.1110534 0.0129393 0.0048849 -0.0131777 0.0926852 0.0001422 0.1321367 -0.0060326 0.0089076 0.0002411 0.0336637 0.075367 0.0333993 -0.0957005 0.0295918 -0.1370745 -0.0663583 0.0399845 0.0463727 0.014442 0.0695625 0.023905 -0.0351002 -0.1127799 -0.0154835 0.0951971 -0.0341483 -0.0439583 -0.0339943 -0.0374834 0.0836505 -0.0653492 0.0013832 -0.0933022 -0.1785164 0.0119959 -0.0180444 0.0049038 0.0600711 -0.0317494 0.0268573 0.1065946 -0.0128491 0.1034768 0.0071372 0.0753993 0.0004082 0.03623 -0.0406991 0.0466251 -0.1195576 0.1000164 0.0485646 0.0626642 -0.0957908 0.0135432 -0.0192218 -0.0237227 -0.0023789 -0.0105763 0.0996644 0.0491087 -0.088502 0.0439725 -0.0802959 -0.0510638 -0.016701 -0.0193284 0.0158151 0.0821421 0.0431051 0.1123512 -0.0384978 0.0836063 -0.0551856 -0.0134594 -0.0659497 -0.0170761 -0.1240176 -0.0191426 -0.0149 -0.014793 -0.0079957 0.121456 unknown
polarizability: 145.5584838|13.1762601|115.8265036|-2.6809607|-1.7827321|72.8762755 unknown
InChI: InChI=1S/C9H12O4/c1-4-6-5(2)13-9(11)7(6)8(10)12-3/h5H,4H2,1-3H3
charge 0 multiplicity 1
25 atoms
O  -1.470485 1.825741 -0.367931
O  2.514665 0.418542 0.304338
O  0.73952 2.538834 -0.590134
O  1.663533 -1.742204 0.134386
C  -2.159711 0.553598 -0.03781
C  -1.044742 -0.461679 0.160504
C  -1.333712 -1.911512 0.431992
C  0.166176 0.17174 0.005548
C  -3.059325 0.77707 1.190747
C  -0.04699 1.617682 -0.336529
C  -1.425469 -2.726523 -0.894076
C  1.484323 -0.493675 0.143161
C  3.873411 -0.161557 0.432529
H  -2.776001 0.285264 -0.919538
H  -0.523218 -2.347498 1.040057
H  -2.284947 -2.008142 0.988182
H  -3.751545 1.610661 0.988133
H  -3.655632 -0.125887 1.412186
H  -2.452272 1.032882 2.075549
H  -1.673072 -3.778172 -0.66713
H  -0.454989 -2.704745 -1.416338
H  -2.204441 -2.327819 -1.568996
H  4.114579 -0.766867 -0.45732
H  3.934045 -0.797754 1.331672
H  4.536498 0.71002 0.514318
