program: Gaussian 09
title: 000013397
version: EM64L-G09RevD.01
frameworkgroup: C1[X(C7H7ClO)]
method: RPBEPBE
basis: SDD
operation: Freq
keyword: #p
keyword: freq=noraman
keyword: PBEPBE/SDD
title: #p freq=noraman PBEPBE/SDD
converged: YES YES NO NO
title: Mulliken charges:
elementType: Cl O C C C C C C C H H H H H H H
charge: -0.058637 -0.439138 0.372869 -0.432597 -0.400492 -0.342352 -0.197726 -0.202661 -0.100290 0.199684 0.238247 0.238357 0.271974 0.256646 0.256815 0.339300
chargesum: 0.00000
title: Mulliken charges with hydrogens summed into heavy atoms:
elementType: Cl O C C C C C C C
charge: -0.058637 -0.099838 0.372869 0.005334 -0.162135 -0.070378 0.058920 0.054155 -0.100290
polarizability: 1.26203105e+02 -1.79526207e+00 8.36732034e+01 3.53954425e+00 1.81445041e+00 4.27487918e+01
1716.lowfreq: -10.4093 -0.0030 -0.0021 -0.0017 3.9101 9.1680 48.2831 99.9728 178.9342
frequency: 48.2739 99.9717 178.9336 249.4879 303.8611 338.3880 376.6613 409.0954 445.1332 503.7354 622.6322 632.9663 706.0125 785.0843 821.1021 833.1341 936.9959 961.2841 967.4076 981.7918 1000.8838 1070.5190 1107.1935 1158.9940 1179.6000 1209.4472 1284.2433 1305.7973 1358.6605 1384.4932 1396.2849 1465.4858 1477.3364 1587.7955 1600.5285 2960.3925 3051.3157 3127.3874 3147.0505 3168.7892 3171.9022 3555.9069
redmass: 3.8348 4.4993 5.9583 3.9821 3.9335 4.3097 1.4889 2.8719 3.4983 3.6024 6.6592 5.1613 3.7866 3.2891 1.6013 1.2602 1.4435 2.2926 1.4716 2.1247 4.0126 2.7295 1.3436 1.1133 1.1132 3.0593 1.2827 1.3543 1.4609 4.4631 2.2325 1.1919 2.0330 7.3902 6.1974 1.0674 1.0950 1.0898 1.0887 1.0955 1.0968 1.0662
irintensity: 4.3523 0.1159 2.5009 7.0929 11.4821 36.2230 116.8958 0.5133 60.7079 24.4984 3.1977 7.3063 1.1510 36.4357 53.0155 6.5228 25.0199 67.0058 5.5100 9.1346 22.5680 34.3122 10.1487 18.3524 0.0551 11.3052 2.2905 6.3380 31.4803 2.8076 11.7797 23.2108 43.5612 2.8031 14.0030 59.5939 17.2265 11.3908 1.2556 7.0872 0.4558 6.6550
temp: 298.150 k
press: 1.00000 atm
elementType: 17 8 6 6 6 6 6 6 6 1 1 1 1 1 1 1
symmnumber: 1
zpe: 316842.7 jmol-1
zpe.correction: 0.120679 hartree
zpe.thermalcorrener: 0.129083 hartree
zpe.thermalcorrenthalpy: 0.130027 hartree
zpe.thermalcorrgfe: 0.086520 hartree
zpe.sumelectzpe: -805.556672 hartree
zpe.sumelectthermal: -805.548268 hartree
zpe.sumelectthermalent: -805.547324 hartree
zpe.sumelectthermalfe: -805.590832 hartree
dipole: -0.8263 1.2759 0.6716
dipole: 1.6618
quadrupole: -70.7845 -53.5187 -59.2752
quadrupole: -4.0680 -2.1297 -0.0787
quadrupole: -9.5917 7.6741 1.9176 -4.0680 -2.1297 -0.0787
hfenergy: -805.6773514 hartree
pointgroup: C01 [X(C7H7Cl1O1)]
dipole: 0.3463475 -0.545208 0.1012088 debye
dipolederiv: -0.8624035 0.0282267 0.0731084 0.0289133 -0.1297324 -0.013669 0.0853307 -0.0149594 -0.0835782 -0.8259595 0.0290034 -0.1981754 0.0276375 -0.4317436 -0.1880474 -0.2926305 -0.2050602 -0.3811371 0.0174218 -0.0044826 -0.0686996 0.0362392 -0.1114236 -0.0498045 -0.1081063 -0.0238149 -0.0891719 0.5727093 0.028699 0.1329909 0.0027433 0.3929452 0.1201831 0.2415277 0.1280914 0.4366087 -0.023097 -0.0391836 -0.0275689 0.0088543 0.0734046 0.0577936 -0.0390297 0.0626294 -0.140565 -0.0306662 0.0523243 -0.0092298 0.0030998 0.0477748 0.03089 0.0356501 0.022172 -0.1518538 -0.3038214 0.0796179 0.0239624 0.1009221 -0.0113211 0.0068174 0.0582308 0.0110773 -0.102566 -0.3023386 -0.0615782 0.0073099 -0.0582646 0.0091586 0.0333421 0.0053383 0.0336284 -0.0993486 1.2323186 -0.0401965 -0.1254822 -0.0581406 0.1056166 0.034817 -0.1413559 0.0398488 -0.0518035 0.0010701 0.0070998 -0.0341542 0.0927672 -0.2054649 -0.0532866 -0.0309451 -0.0163622 0.046926 -0.0419995 -0.0166936 0.0470506 -0.0844855 0.064557 0.0714506 0.0248451 0.0243051 -0.0804609 0.0218107 0.0928391 0.0287288 0.0735094 -0.0428686 -0.0459299 0.0179814 -0.0455359 0.1421092 0.0584684 -0.0736116 0.0007768 -0.0623202 0.0053151 -0.0235134 0.0054694 -0.0268325 0.1517679 0.0395711 -0.07597 -0.0061122 -0.0696144 0.0064613 -0.0255635 -0.0012868 -0.0239641 0.1628958 0.0552307 0.0646458 0.0212272 0.060106 -0.001848 -0.0396221 0.0144376 -0.0434868 0.1539454 0.3916852 -0.07074 0.1342673 -0.1019667 0.229169 0.0841426 0.1245433 0.0782636 0.086232 unknown
polarizability: 125.9708639|1.0538907|81.2983063|-6.0296237|9.5866428|45.3559304 unknown
InChI: InChI=1S/C7H7ClO/c8-7-3-1-6(5-9)2-4-7/h1-4,9H,5H2
charge 0 multiplicity 1
16 atoms
Cl -3.593931 0.072886 0.223951
O  3.25627 0.682255 0.511994
C  1.01984 -0.127442 -0.255976
C  2.531492 -0.184462 -0.431214
C  0.227405 -1.290998 -0.414393
C  0.381426 1.099479 0.060339
C  -1.178787 -1.239519 -0.276204
C  -1.021217 1.169492 0.208176
C  -1.779808 -0.005239 0.034007
H  2.88293 -1.235771 -0.362386
H  2.83015 0.207498 -1.419611
H  0.704309 -2.250593 -0.648422
H  0.991293 1.99974 0.190954
H  -1.789324 -2.13857 -0.399308
H  -1.513694 2.115685 0.451046
H  3.009546 0.424261 1.436646
