program: Gaussian 09
title: 000164420
version: EM64L-G09RevD.01
frameworkgroup: C1[X(C16H17N3O2)]
method: RPBEPBE
basis: SDD
operation: Freq
keyword: #p
keyword: freq=noraman
keyword: PBEPBE/SDD
title: #p freq=noraman PBEPBE/SDD
converged: YES YES NO NO
title: Mulliken charges:
elementType: O O N N N C C C C C C C C C C C C C C C C H H H H H H H H H H H H H H H H H
charge: -0.196512 -0.265950 -0.377613 -0.089699 -0.012228 -0.550756 -0.396762 -0.067846 0.166510 0.471647 0.326609 0.075803 -0.372814 -0.431070 -0.317853 -0.821870 -0.352740 -0.363469 0.317490 -0.383570 -0.537195 0.228025 0.215616 0.220584 0.274000 0.340068 0.236781 0.243556 0.274776 0.240163 0.237634 0.239206 0.251455 0.243034 0.246546 0.247393 0.223128 0.217925
chargesum: 0.00000
title: Mulliken charges with hydrogens summed into heavy atoms:
elementType: O O N N N C C C C C C C C C C C C C C C C
charge: -0.196512 -0.265950 -0.037545 -0.089699 -0.012228 -0.107115 0.097822 -0.067846 0.166510 0.471647 0.326609 0.075803 -0.136033 -0.187514 -0.043076 -0.104867 -0.101285 -0.120435 0.317490 -0.137024 0.151250
polarizability: 2.50056042e+02 1.67983555e+01 2.27261821e+02 -3.14802403e+01 7.53183466e+00 1.24113447e+02
1716.lowfreq: -0.0002 0.0004 0.0006 2.0679 4.1528 10.4779 15.4924 21.0491 27.4178
frequency: 13.7696 21.0079 26.9000 58.6260 69.7030 91.6229 106.9562 156.6639 176.7845 194.7166 217.1256 221.5524 228.4696 243.3456 269.8469 312.2768 332.1166 345.3093 390.8286 397.4984 415.2016 461.5670 498.0958 506.1882 517.7499 530.8056 544.6150 563.2742 576.0127 608.3788 634.1395 656.5649 673.9631 700.1256 716.9452 732.6233 760.6969 785.5916 796.9505 805.2622 818.4403 834.6649 865.4056 925.2918 937.7850 957.5300 965.1447 977.7912 987.4509 995.0578 1004.3165 1020.3450 1037.5176 1044.2770 1050.6185 1111.4032 1112.2786 1115.6563 1155.6924 1173.2884 1179.6763 1193.9000 1212.0463 1225.6482 1229.3325 1248.7912 1293.6350 1303.0923 1313.1594 1322.1833 1347.8612 1354.4570 1373.7543 1382.3397 1405.0951 1416.9675 1431.7794 1435.7841 1458.4587 1466.9610 1467.2529 1472.2075 1473.1382 1477.5867 1483.1219 1502.7428 1536.3368 1582.1255 1586.5266 1590.2692 1622.9863 2958.5326 2968.0855 2991.0791 2992.9413 3042.3149 3045.9197 3057.7512 3083.2365 3093.9983 3120.9340 3123.3263 3126.2317 3159.7513 3166.2562 3167.7266 3254.2667 3564.4988
redmass: 5.0239 5.6122 3.6429 4.7112 4.3396 4.2998 3.9257 3.9497 2.3091 1.6044 2.9625 2.6338 1.8184 2.0687 2.7920 4.0721 4.5877 2.7877 3.3406 3.8720 2.9569 2.8695 3.6397 3.4682 7.6886 2.8435 1.7104 2.2167 5.7212 3.4214 6.7242 11.2767 3.4352 4.5143 5.7770 3.9775 1.4247 8.4321 5.2067 3.0477 1.6304 1.5911 2.5669 1.4350 1.4091 2.6175 1.3480 2.2340 6.2480 2.5592 2.5462 2.4311 3.4310 1.4819 5.0261 1.3887 1.4222 2.7848 1.3418 1.3587 1.2508 1.6499 2.1443 2.4250 4.0452 1.8128 2.2739 1.3286 4.8469 1.3830 1.4687 5.0295 1.5153 4.5110 1.2499 3.3325 1.8972 1.1701 1.1650 1.0513 1.1669 1.4308 1.1611 1.1213 1.4168 2.4950 5.2580 6.9670 5.0195 6.1859 6.4515 1.0331 1.0386 1.0631 1.0655 1.0984 1.1038 1.1004 1.0966 1.0974 1.0895 1.0896 1.0988 1.0936 1.0952 1.0921 1.1000 1.0766
irintensity: 3.4819 0.7891 0.4693 1.6739 2.3617 0.6342 2.6272 0.9885 1.2646 2.4250 2.9729 0.0230 0.3324 0.1112 0.8004 1.8526 0.4070 3.1500 10.1932 1.9680 0.2013 7.2130 8.9235 24.7095 3.5574 12.8658 37.9660 74.5205 9.7955 11.5433 0.1553 1.4806 12.3723 5.4632 1.5891 3.1082 36.2055 1.7444 0.3197 28.8193 24.4841 33.3190 27.2040 10.6417 0.9478 5.9731 0.2526 9.5909 41.3962 4.5637 5.6042 12.7925 10.8179 4.9025 37.7512 4.2750 6.5812 56.7715 0.3735 27.7583 36.2089 11.7558 9.3980 13.0144 176.6305 27.7190 13.0914 0.2149 39.8314 33.0469 56.9980 36.9648 0.8562 11.5750 10.8329 3.8118 26.9487 11.4552 16.9045 14.6343 20.2899 63.1877 19.6927 17.9327 17.5870 128.2612 119.2086 8.6341 148.3126 498.9723 41.7857 60.2261 22.0170 29.7648 47.6984 17.0958 49.1924 27.5526 18.6672 3.0320 13.6932 28.9808 13.9349 12.1617 5.2839 19.9011 1.1473 47.1858
temp: 298.150 k
press: 1.00000 atm
elementType: 8 8 7 7 7 6 6 6 6 6 6 6 6 6 6 6 6 6 6 6 6 1 1 1 1 1 1 1 1 1 1 1 1 1 1 1 1 1
symmnumber: 1
zpe: 794056.6 jmol-1
zpe.correction: 0.302440 hartree
zpe.thermalcorrener: 0.321360 hartree
zpe.thermalcorrenthalpy: 0.322304 hartree
zpe.thermalcorrgfe: 0.252587 hartree
zpe.sumelectzpe: -933.072068 hartree
zpe.sumelectthermal: -933.053148 hartree
zpe.sumelectthermalent: -933.052204 hartree
zpe.sumelectthermalfe: -933.121921 hartree
dipole: 5.8887 2.1752 -0.7195
dipole: 6.3187
quadrupole: -153.7151 -107.2228 -122.6465
quadrupole: 7.0322 7.2811 3.0210
quadrupole: -25.8536 20.6387 5.2149 7.0322 7.2811 3.0210
hfenergy: -933.3745079 hartree
pointgroup: C01 [X(C16H17N3O2)]
dipole: 2.1781898 1.1359131 -0.3810608 debye
polarizability: 241.3729652|20.4980617|231.2187254|-38.7596335|6.0137604|128.8396203 unknown
InChI: InChI=1S/C16H17N3O2/c1-11-9-21-16-14(11)15(18-10-19-16)17-8-7-12-3-5-13(20-2)6-4-12/h3-6,9-10,17H,7-8H2,1-2H3
charge 0 multiplicity 1
38 atoms
O  -4.457555 1.480086 0.900068
O  5.031326 1.773232 -0.162265
N  -0.68374 -1.150536 -0.374587
N  -2.620597 -2.172636 0.520129
N  -4.614307 -0.914097 1.195708
C  1.2085 -2.488393 0.6043
C  0.060538 -2.415814 -0.447119
C  -2.613411 0.240933 0.272088
C  -1.956634 -1.030381 0.136096
C  2.220178 -1.361965 0.451562
C  -2.31106 1.644169 0.013557
C  -3.926087 0.182821 0.809428
C  3.22076 -1.412489 -0.55934
C  2.172362 -0.210729 1.274482
C  -3.441201 2.338392 0.404864
C  -1.050465 2.239084 -0.561468
C  4.135213 -0.359884 -0.739972
C  3.083583 0.861067 1.110793
C  4.069595 0.783922 0.096846
C  -3.887625 -2.057503 1.016433
C  5.027272 2.960611 0.695083
H  0.756594 -2.469251 1.612806
H  1.705431 -3.471076 0.486029
H  0.482686 -2.527384 -1.464714
H  -0.664275 -3.227164 -0.274545
H  -0.17212 -0.295114 -0.593642
H  3.289974 -2.295995 -1.206337
H  1.420267 -0.152684 2.07114
H  -3.695225 3.394942 0.404448
H  -0.16203 1.99452 0.053056
H  -0.861093 1.87488 -1.589529
H  -1.118759 3.339015 -0.61327
H  4.911869 -0.400845 -1.509836
H  3.022005 1.72681 1.777421
H  -4.37667 -2.991961 1.305993
H  5.853368 3.585095 0.324934
H  5.207558 2.693121 1.754536
H  4.072973 3.516698 0.610323
