program: Gaussian 09
title: 000164217
version: EM64L-G09RevD.01
frameworkgroup: C1[X(C15H19ClN4O2)]
method: RPBEPBE
basis: SDD
operation: Freq
keyword: #p
keyword: freq=noraman
keyword: PBEPBE/SDD
title: #p freq=noraman PBEPBE/SDD
converged: YES YES NO NO
title: Mulliken charges:
elementType: Cl O O N N N N C C C C C C C C C C C C C C C H H H H H H H H H H H H H H H H H H H
charge: -0.058473 -0.482589 -0.250972 -0.108591 -0.062200 -0.063816 -0.117888 0.098597 0.260612 -0.479804 0.375900 -0.721646 -0.771626 -0.229184 -0.356775 -0.359934 -0.243579 -0.225909 -0.152005 -0.113317 -0.291571 -0.496148 0.243470 0.265190 0.246583 0.244167 0.218966 0.221968 0.223010 0.266346 0.260520 0.363783 0.247912 0.284764 0.257149 0.255095 0.298931 0.258852 0.233806 0.229581 0.230826
chargesum: 0.00000
title: Mulliken charges with hydrogens summed into heavy atoms:
elementType: Cl O O N N N N C C C C C C C C C C C C C C C
charge: -0.058473 -0.118806 -0.250972 -0.108591 -0.062200 -0.063816 -0.117888 0.098597 0.260612 0.028855 0.375900 -0.011931 -0.060302 0.031336 -0.108862 -0.075170 0.013570 0.029186 0.146926 -0.113317 -0.032719 0.198066
polarizability: 2.68271657e+02 1.34651723e+00 1.70232462e+02 -8.63062984e+00 6.25733291e-01 1.72521840e+02
1716.lowfreq: -9.1210 -6.2147 -0.0009 0.0011 0.0013 1.6889 31.5964 36.5271 43.6295
frequency: 31.5778 36.5257 43.5683 49.0037 52.2133 61.2469 97.2757 100.0557 118.8474 150.6124 151.5290 163.6531 186.3876 205.0920 234.9300 248.6565 256.5107 280.5010 289.0310 292.0838 303.7436 317.4433 328.2216 351.9757 357.6752 412.1389 415.3653 442.4073 469.6707 484.4191 506.9472 548.1541 570.3571 613.9361 626.6569 647.0649 668.2975 709.9466 729.8797 740.7971 774.9410 820.7314 833.8547 834.8529 840.4273 844.9823 868.0419 906.1419 916.0370 921.3844 934.9761 939.9628 948.7496 960.8734 965.2250 982.5459 996.3043 999.7130 1003.1729 1035.5508 1056.7573 1076.4868 1107.4485 1111.7684 1113.5684 1142.2087 1148.6372 1158.4450 1178.2282 1178.8904 1189.2284 1206.4294 1229.8317 1239.0200 1282.3226 1294.9753 1314.0710 1323.0685 1335.8312 1367.3168 1375.5615 1388.8970 1393.1406 1399.7909 1420.5467 1426.9265 1442.9168 1449.6430 1463.9386 1469.2463 1473.1007 1475.1203 1479.4726 1486.8593 1491.5755 1578.5937 1584.3858 1599.8635 2984.3674 2986.7077 2988.5339 3029.3850 3058.5562 3073.8270 3081.8338 3085.3063 3100.2914 3104.1841 3105.6223 3126.2650 3143.8464 3149.6627 3161.1698 3172.5152 3184.6215 3251.6131 3270.2611
redmass: 9.6052 3.9415 5.1981 4.5868 2.8096 3.9821 4.6077 2.9548 2.6573 4.8779 2.4651 5.3199 4.2648 2.8573 2.8583 1.6220 1.6772 1.6157 4.1489 4.2219 3.1607 4.7080 3.4875 3.9354 3.4084 3.1945 3.1059 4.4921 3.7282 3.9477 3.8921 4.1591 3.1459 4.0909 7.1327 4.4626 3.3860 4.9573 3.9773 5.5378 1.1025 1.5703 1.9201 1.9655 1.4300 1.3881 2.8814 3.3115 2.3494 3.3897 1.6322 1.6647 1.6415 3.3633 2.2965 1.4304 2.0988 4.3015 2.5918 2.6077 3.5947 2.6112 2.2527 1.2493 1.5313 2.4063 1.5056 3.1117 1.6919 2.2160 1.1408 3.2405 2.7116 3.2711 2.0560 1.2668 1.4721 2.3561 1.7870 5.3866 1.1949 3.4009 1.8859 1.3579 1.1778 2.5564 1.4015 1.0563 1.0563 1.0524 1.0526 1.1330 2.1521 1.0800 1.0783 8.3589 7.4982 6.2456 1.0297 1.0353 1.0361 1.0631 1.0902 1.0991 1.0989 1.1056 1.0991 1.0986 1.1007 1.1020 1.0680 1.0880 1.0896 1.0961 1.0955 1.0976 1.1014
irintensity: 0.5968 0.5849 1.0059 0.2593 1.4225 0.4421 0.2286 0.5097 2.5607 4.0148 4.5314 0.4986 0.8965 0.7361 1.3006 1.0154 1.8531 0.2418 5.0737 0.8755 0.9312 7.3504 1.5762 11.3825 6.8309 0.9892 1.7236 18.6980 13.2824 14.1179 3.4639 4.0286 15.1238 10.5817 0.4991 9.6761 24.1681 6.8234 7.6058 18.6398 146.6743 60.2467 51.9395 21.4407 29.0329 2.7298 15.8893 32.8645 13.5438 14.7411 9.8779 3.2490 4.0017 15.0437 14.9673 2.1531 78.3352 27.0088 110.2025 33.0019 19.7700 33.5066 30.3011 0.1107 2.7641 3.2496 0.3174 2.4734 18.4901 2.2406 2.5747 14.0664 14.5051 23.4886 11.0804 0.7122 2.5190 13.1634 11.9742 2.1686 15.2632 4.6600 14.7158 11.4611 16.1617 23.7336 122.9898 13.9889 7.6320 2.9231 30.3406 11.2889 48.2315 8.4847 24.2176 0.9392 2.1811 21.5925 68.9721 18.5504 19.9101 19.4634 17.1618 25.4730 25.4453 40.2052 21.9316 8.5734 9.5474 37.6855 419.3722 14.8089 1.2873 3.7854 1.4487 1.7500 3.6650
temp: 298.150 k
press: 1.00000 atm
elementType: 17 8 8 7 7 7 7 6 6 6 6 6 6 6 6 6 6 6 6 6 6 6 1 1 1 1 1 1 1 1 1 1 1 1 1 1 1 1 1 1 1
symmnumber: 1
zpe: 844178.1 jmol-1
zpe.correction: 0.321530 hartree
zpe.thermalcorrener: 0.343643 hartree
zpe.thermalcorrenthalpy: 0.344587 hartree
zpe.thermalcorrgfe: 0.269174 hartree
zpe.sumelectzpe: -1410.776466 hartree
zpe.sumelectthermal: -1410.754354 hartree
zpe.sumelectthermalent: -1410.753410 hartree
zpe.sumelectthermalfe: -1410.828822 hartree
dipole: 5.7212 -4.1154 1.5292
dipole: 7.2116
quadrupole: -131.5969 -149.7118 -132.8636
quadrupole: 0.2440 -7.4905 2.7105
quadrupole: 6.4605 -11.6544 5.1938 0.2440 -7.4905 2.7105
hfenergy: -1411.0979963 hartree
pointgroup: C01 [X(C15H19Cl1N4O2)]
dipole: 2.3586259 1.376234 -0.7700222 debye
polarizability: 267.798048|-10.3314036|171.3680236|4.0975149|0.3695506|171.8598865 unknown
InChI: InChI=1S/C15H19ClN4O2/c1-14(2,8-19-22-3)15(21,9-20-11-17-10-18-20)12-4-6-13(16)7-5-12/h4-8,10-11,21H,9H2,1-3H3
charge 0 multiplicity 1
41 atoms
Cl -5.359034 1.819427 0.697462
O  1.144248 0.157435 1.304141
O  4.944216 0.502167 -0.052123
N  0.007512 -2.129478 -0.261735
N  3.498786 0.544912 0.133709
N  -0.827793 -2.876134 -1.109576
N  -0.916275 -3.681482 1.067352
C  0.594465 0.321143 -0.054267
C  1.397054 1.496967 -0.798322
C  0.786482 -1.022696 -0.827215
C  -0.893051 0.666033 0.1190
C  1.18257 2.845292 -0.041184
C  0.958111 1.689396 -2.277123
C  2.909719 1.245056 -0.800435
C  -1.839736 0.443027 -0.91362
C  -1.345702 1.220178 1.342144
C  -3.197631 0.792721 -0.746697
C  -2.699639 1.573636 1.528542
C  -0.064116 -2.625791 1.022398
C  -3.60612 1.362399 0.473047
C  -1.352112 -3.793932 -0.249125
C  5.540007 -0.291957 1.037619
H  0.460388 -0.945621 -1.874992
H  1.859573 -1.282757 -0.821738
H  1.377044 2.721429 1.037125
H  0.146417 3.199182 -0.176768
H  1.865825 3.620091 -0.43534
H  1.471456 2.570053 -2.705374
H  1.201244 0.821406 -2.915454
H  -0.126463 1.877464 -2.336182
H  3.504257 1.728625 -1.593705
H  2.151137 0.120111 1.201022
H  -1.545872 -0.034672 -1.853388
H  -0.627715 1.348355 2.155649
H  -3.921971 0.608685 -1.54507
H  -3.040941 1.997205 2.477463
H  0.468346 -2.182348 1.857076
H  -2.059249 -4.548224 -0.583517
H  6.621038 -0.278571 0.827405
H  5.161293 -1.329384 1.022384
H  5.336133 0.17165 2.019111
