program: Gaussian 09
title: 000164193
version: EM64L-G09RevD.01
frameworkgroup: C1[X(C17H13ClFNO)]
method: RPBEPBE
basis: SDD
operation: Freq
keyword: #p
keyword: freq=noraman
keyword: PBEPBE/SDD
title: #p freq=noraman PBEPBE/SDD
converged: YES YES NO NO
title: Mulliken charges:
elementType: Cl F O N C C C C C C C C C C C C C C C C C H H H H H H H H H H H H H
charge: -0.056322 -0.207898 -0.293142 -0.033519 -0.171471 0.322078 0.367424 0.198960 -0.710654 -0.011537 0.127202 -0.321543 -0.318607 -0.357285 -0.286057 -0.358440 -0.241700 -0.380953 -0.233003 -0.090961 -0.198833 0.252357 0.231104 0.231809 0.240610 0.260242 0.255868 0.266519 0.287554 0.259308 0.235075 0.240056 0.256533 0.239226
chargesum: 0.00000
title: Mulliken charges with hydrogens summed into heavy atoms:
elementType: Cl F O N C C C C C C C C C C C C C C C C C
charge: -0.056322 -0.207898 -0.293142 -0.033519 0.080886 0.322078 0.367424 0.198960 -0.007131 -0.011537 0.127202 -0.061300 -0.062739 -0.090766 0.001497 -0.099132 -0.006625 -0.140896 0.023530 -0.090961 0.040393
polarizability: 2.83110506e+02 2.98915438e+01 1.90335635e+02 -9.06260127e+00 -1.48136989e+00 1.41522260e+02
1716.lowfreq: -3.2059 -0.0015 -0.0012 -0.0010 4.5949 11.0131 19.2065 26.5243 39.2393
frequency: 19.1669 26.1630 39.2330 76.8438 99.7747 118.3341 143.8044 161.4000 185.4116 215.1046 230.5934 235.1987 255.8073 265.6509 288.7369 337.5104 366.3853 388.6919 427.8610 454.9742 475.0283 501.3225 502.3461 513.0002 529.2102 559.1484 578.2027 600.5433 617.8432 635.9062 638.1176 725.7436 732.1782 739.9087 767.0833 773.7542 793.6659 814.6831 826.0679 831.1071 847.4812 863.9897 894.2815 894.6811 946.7751 950.7186 969.5484 987.5198 997.9294 1032.7037 1048.6528 1056.4447 1058.5172 1074.0472 1093.7046 1127.4619 1153.3054 1165.6231 1170.5951 1208.3197 1217.2557 1239.7728 1250.3894 1275.5192 1322.1273 1331.0236 1335.1205 1353.7388 1390.2206 1390.7426 1395.4048 1426.5306 1431.7393 1440.4082 1461.7633 1469.7931 1477.8261 1493.9146 1551.0700 1571.7174 1589.5813 1612.5834 1623.6558 2998.0870 3025.0613 3101.7385 3105.4793 3125.6837 3139.0757 3150.7274 3159.3692 3166.2033 3179.6258 3180.6828 3183.9843 3184.1883
redmass: 7.8085 6.6485 6.0099 6.2704 5.4806 4.7639 4.8503 4.6669 4.3209 3.5941 4.5346 1.3249 5.2741 5.4142 5.6467 7.6054 4.2482 5.8820 3.0975 5.5274 3.4246 4.4785 5.1363 6.1615 5.1403 4.2700 6.6825 5.1115 6.2520 6.4355 3.5679 5.1616 3.5601 4.2549 1.2608 2.5480 5.4047 4.9551 1.3570 1.7546 5.5462 1.3974 5.0998 1.5191 1.4220 1.3751 1.3251 1.3378 2.0129 2.0575 3.5845 1.8541 2.1796 2.2728 2.8007 2.3508 1.3856 1.6566 1.1848 2.2560 2.2999 1.4554 2.5249 1.7282 1.3487 4.2655 1.4323 2.2450 3.2357 1.5502 2.6325 4.0670 2.6894 2.2961 1.1078 1.1670 1.9367 4.1960 8.4237 6.4733 6.4232 7.7104 7.5877 1.0352 1.0856 1.0998 1.1011 1.0905 1.0864 1.0908 1.0877 1.0955 1.0973 1.0995 1.0940 1.0937
irintensity: 0.0644 1.3258 0.0255 0.2657 0.3922 0.7677 2.0335 0.7696 4.2151 0.1049 0.1413 0.1598 3.9698 1.9258 0.7439 3.4824 3.6795 2.7854 9.7739 4.3485 12.1099 8.5220 2.2079 6.5177 0.5538 4.8237 9.5705 3.6466 0.4901 14.9744 9.4321 17.3717 7.0532 2.5748 88.3448 1.5900 13.5259 6.4456 49.7039 33.4531 112.9814 0.0600 25.9807 23.8987 0.8903 5.7754 0.9052 1.2565 17.1151 13.5305 55.9488 12.4383 114.5889 38.2291 79.9015 4.9879 18.4140 16.9117 5.7563 16.2426 13.5156 16.3903 141.9815 21.8702 24.2165 32.3734 5.9928 22.0762 22.5329 65.9615 11.2711 70.3436 4.1901 21.9410 0.3422 29.2900 22.4581 72.0530 86.7395 103.4585 13.6834 84.7712 9.3214 13.6120 7.3934 16.1298 28.3777 22.0625 0.7145 7.8587 0.0177 11.9465 3.6704 7.7537 2.4948 5.5645
temp: 298.150 k
press: 1.00000 atm
elementType: 17 9 8 7 6 6 6 6 6 6 6 6 6 6 6 6 6 6 6 6 6 1 1 1 1 1 1 1 1 1 1 1 1 1
symmnumber: 1
zpe: 666233.9 jmol-1
zpe.correction: 0.253755 hartree
zpe.thermalcorrener: 0.271547 hartree
zpe.thermalcorrenthalpy: 0.272491 hartree
zpe.thermalcorrgfe: 0.206126 hartree
zpe.sumelectzpe: -1344.024545 hartree
zpe.sumelectthermal: -1344.006753 hartree
zpe.sumelectthermalent: -1344.005809 hartree
zpe.sumelectthermalfe: -1344.072175 hartree
dipole: 5.3059 -2.7450 0.4728
dipole: 5.9926
quadrupole: -133.7555 -125.4141 -123.6341
quadrupole: 4.1430 7.7018 0.7661
quadrupole: -6.1543 2.1872 3.9671 4.1430 7.7018 0.7661
hfenergy: -1344.2783003 hartree
pointgroup: C01 [X(C17H13Cl1F1N1O1)]
dipole: -2.302931 0.1030982 -0.4943893 debye
polarizability: 258.8744751|34.5809525|156.1222841|-39.7148645|-26.8176935|199.9716419 unknown
InChI: InChI=1S/C17H13ClFNO/c1-11(13-4-2-3-5-15(13)19)21-17-8-9-20-16-10-12(18)6-7-14(16)17/h2-11H,1H3
charge 0 multiplicity 1
34 atoms
Cl 5.798009 1.775364 -1.683476
F  -3.253118 -2.247341 1.544487
O  -0.481008 -0.840192 -1.139332
N  2.61903 -0.462699 1.768367
C  -1.805094 -1.449428 -0.810779
C  -2.651284 -0.476222 0.00168
C  0.481553 -0.737651 -0.13585
C  1.727148 -0.134968 -0.541949
C  -2.430687 -1.7871 -2.169782
C  2.768946 -0.021069 0.456576
C  -3.373267 -0.892941 1.137072
C  -2.773944 0.886644 -0.369457
C  0.33374 -1.178314 1.186164
C  1.965527 0.340431 -1.868671
C  4.02091 0.570975 0.091444
C  -4.196741 -0.047169 1.895542
C  -3.58784 1.770965 0.370109
C  1.433306 -1.015995 2.085989
C  3.192582 0.915885 -2.209539
C  4.204861 1.020464 -1.211972
C  -4.303029 1.304785 1.499446
H  -1.632369 -2.378726 -0.236651
H  -2.575598 -0.873103 -2.770942
H  -3.414235 -2.265653 -2.021344
H  -1.778786 -2.479717 -2.728285
H  -2.204356 1.249028 -1.232133
H  -0.586143 -1.63493 1.556779
H  1.173663 0.24501 -2.616696
H  4.796559 0.649318 0.856889
H  -4.72869 -0.439524 2.766938
H  -3.663093 2.82135 0.071223
H  1.325397 -1.359879 3.12177
H  3.383508 1.281717 -3.222158
H  -4.936358 1.988385 2.07394
