program: Gaussian 09
title: 000164179
version: EM64L-G09RevD.01
frameworkgroup: C1[X(C19H16ClFN2O)]
method: RPBEPBE
basis: SDD
operation: Freq
keyword: #p
keyword: freq=noraman
keyword: PBEPBE/SDD
title: #p freq=noraman PBEPBE/SDD
converged: YES YES NO NO
title: Mulliken charges:
elementType: Cl F O N N C C C C C C C C C C C C C C C C C C C H H H H H H H H H H H H H H H H
charge: -0.060805 -0.170895 -0.266012 -0.237596 0.027344 -0.432566 -0.561928 0.377642 0.310333 0.521030 -0.230762 0.179284 -0.303554 -0.384033 -0.386629 -0.412103 0.284051 -0.364982 -0.770993 -0.218333 -0.378574 -0.215654 -0.209644 -0.107228 0.247467 0.270476 0.211675 0.250908 0.254068 0.263127 0.257798 0.239453 0.249809 0.243447 0.247835 0.263545 0.239782 0.263729 0.255229 0.254258
chargesum: 0.00000
title: Mulliken charges with hydrogens summed into heavy atoms:
elementType: Cl F O N N C C C C C C C C C C C C C C C C C C C
charge: -0.060805 -0.170895 -0.266012 -0.237596 0.027344 0.085376 -0.099344 0.377642 0.310333 0.521030 -0.230762 0.179284 -0.049486 -0.120907 -0.128830 -0.172650 0.284051 -0.115173 -0.016166 0.021449 -0.114845 0.039575 0.044614 -0.107228
polarizability: 2.78058925e+02 -1.85280792e+01 2.24502551e+02 2.65727186e+01 8.48312825e+00 2.00395936e+02
1716.lowfreq: 0.0005 0.0016 0.0016 0.8864 4.0496 9.4322 15.1509 20.4797 23.9391
frequency: 14.7630 20.3563 23.7257 39.3110 52.8715 72.6937 75.7250 92.9587 108.9430 117.1936 163.0283 176.9218 187.0041 229.8860 238.6893 256.9795 271.9220 324.8884 326.9802 360.0633 373.5693 385.4727 401.3079 409.8233 461.3856 467.4989 472.3241 512.9714 519.8517 539.0928 543.5839 576.1284 596.8653 608.5208 626.3924 627.9421 660.0236 697.9718 721.9524 758.1525 767.9579 786.7902 798.7680 808.1000 827.1243 834.0882 842.9598 857.3569 867.1161 900.1447 943.4825 950.6714 961.3975 971.3062 975.6483 981.2439 1000.4558 1018.4983 1033.7326 1042.6500 1050.3499 1067.9405 1071.7777 1083.9893 1114.0489 1158.1428 1178.4304 1183.5193 1203.8557 1213.3817 1216.0635 1239.3253 1276.1911 1285.3277 1295.1982 1300.1421 1322.6899 1356.8969 1362.6158 1368.8306 1377.2538 1384.9098 1394.6762 1397.3355 1421.6309 1446.9919 1450.8814 1456.0364 1465.2227 1477.4270 1482.5714 1498.8421 1554.3013 1578.7027 1587.0149 1595.6389 1600.9773 1621.6575 2999.2373 3000.8777 3018.5405 3059.5432 3087.9215 3091.0895 3127.8612 3128.1436 3131.4481 3131.5751 3147.6258 3161.9040 3165.7203 3168.2472 3171.4042 3181.2076
redmass: 8.9301 5.9054 4.0876 5.6531 5.8418 5.0658 7.0317 3.4131 1.2151 4.1533 6.1630 4.2863 5.7069 3.8496 4.6339 7.1356 4.6397 3.5949 6.0456 4.4420 3.3505 5.7792 5.8297 2.9135 3.9191 3.6080 8.3561 3.2242 6.4168 4.6612 4.8497 5.0531 4.3656 3.8830 6.3571 5.9177 4.9042 5.0602 4.1525 3.0744 1.7436 1.5778 4.4399 2.2853 2.5440 1.2962 1.9552 2.6303 2.0752 1.4092 3.1756 1.3843 1.4398 1.3758 1.8820 1.3193 4.3101 4.2760 1.7369 1.9844 2.3015 1.7387 2.7281 3.2679 1.3850 1.8883 1.3757 1.1218 1.7202 2.1123 2.5709 2.0921 2.2547 1.8304 1.4332 1.3093 4.3583 1.6716 2.6500 1.5193 6.6900 1.2364 2.3919 2.5782 4.0698 1.1436 1.0765 2.8726 1.0763 2.2468 1.1535 4.6464 7.2453 7.2438 7.3158 6.8334 6.2816 7.3425 1.0376 1.0594 1.0587 1.1021 1.0969 1.1070 1.1000 1.0901 1.0897 1.0903 1.0867 1.0961 1.0938 1.0950 1.0960 1.0979
irintensity: 0.1908 0.0105 0.1329 0.8907 0.4342 3.1926 1.7764 3.9850 0.7769 0.9396 1.0315 5.6525 0.7154 0.6977 0.1640 3.3217 2.1388 0.3510 2.9478 2.7025 3.3129 4.8656 15.9131 0.0367 1.8931 1.8008 1.3472 23.8638 3.4509 6.4689 4.1283 11.1528 15.1487 0.3263 3.7092 5.9707 10.1335 8.0500 18.1029 1.8296 35.9602 14.1286 1.8051 24.1220 60.1344 0.9874 26.8800 12.8029 24.8995 0.3693 19.0040 2.2315 0.7410 1.9118 47.2645 1.8071 42.2756 5.9974 12.5119 3.1020 3.5568 4.7265 42.2445 32.7345 6.6119 3.8593 3.7692 0.1983 55.7024 4.4258 11.1322 34.0426 50.4263 133.6472 40.0842 11.1041 2.0054 37.1464 18.9834 17.5335 0.1529 50.4307 128.4853 2.6572 45.3823 38.6707 11.9689 24.5328 18.1671 94.5357 13.4876 140.2402 29.2997 59.1029 0.6126 201.8494 5.7158 4.8529 5.6113 13.2095 21.7246 3.4530 9.3244 10.7676 9.7162 12.0632 16.5334 7.2993 1.5081 11.2367 9.3225 6.1641 0.5795 5.1558
temp: 298.150 k
press: 1.00000 atm
elementType: 17 9 8 7 7 6 6 6 6 6 6 6 6 6 6 6 6 6 6 6 6 6 6 6 1 1 1 1 1 1 1 1 1 1 1 1 1 1 1 1
symmnumber: 1
zpe: 796703.1 jmol-1
zpe.correction: 0.303448 hartree
zpe.thermalcorrener: 0.324873 hartree
zpe.thermalcorrenthalpy: 0.325817 hartree
zpe.thermalcorrgfe: 0.249176 hartree
zpe.sumelectzpe: -1476.575238 hartree
zpe.sumelectthermal: -1476.553813 hartree
zpe.sumelectthermalent: -1476.552869 hartree
zpe.sumelectthermalfe: -1476.629510 hartree
dipole: 1.5723 0.6078 -0.4977
dipole: 1.7576
quadrupole: -177.0566 -151.1250 -137.8340
quadrupole: 7.4663 -10.2133 11.0378
quadrupole: -21.7181 4.2136 17.5045 7.4663 -10.2133 11.0378
hfenergy: -1476.8786862 hartree
pointgroup: C01[X(C19H16Cl1F1N2O1)]
dipole: -0.6088393 0.3101783 0.1062474 debye
polarizability: 277.8839644|20.95061|217.4209427|25.5505868|-12.7469512|207.6525046 unknown
InChI: InChI=1S/C19H16ClFN2O/c1-13(24)23(12-10-14-5-7-15(20)8-6-14)18-9-11-22-19-16(18)3-2-4-17(19)21/h2-9,11H,10,12H2,1H3
charge 0 multiplicity 1
40 atoms
Cl 7.068945 -1.990107 1.037422
F  -5.175897 -2.50274 -0.087203
O  0.632119 3.488918 0.411194
N  -0.419581 1.471899 -0.048337
N  -3.636998 -0.864172 -1.720349
C  0.828253 0.749232 0.319544
C  1.848131 0.69808 -0.854048
C  -1.512321 0.710514 -0.593654
C  -2.319014 -0.118341 0.271325
C  3.144192 0.033459 -0.419994
C  -3.367739 -0.898508 -0.361823
C  -0.412891 2.875997 0.035123
C  -1.796203 0.736935 -1.962789
C  -2.136292 -0.180878 1.689422
C  4.111446 0.768926 0.314416
C  3.401029 -1.33361 -0.694798
C  -4.164111 -1.733227 0.491225
C  -2.86952 -0.057215 -2.476438
C  -1.703556 3.607446 -0.313261
C  -2.949715 -1.008662 2.46717
C  -3.974291 -1.802478 1.867275
C  5.3062 0.163484 0.762134
C  4.590376 -1.959308 -0.255692
C  5.52543 -1.196497 0.468624
H  0.564138 -0.274366 0.638268
H  1.286915 1.282539 1.170294
H  1.396395 0.152606 -1.703781
H  2.039742 1.737976 -1.17441
H  -1.192797 1.348042 -2.640887
H  -1.364399 0.438892 2.155693
H  3.93356 1.82903 0.531665
H  2.670367 -1.920133 -1.264804
H  -3.097306 -0.040175 -3.548441
H  -1.787209 3.756418 -1.405217
H  -2.604215 3.065903 0.021598
H  -1.666813 4.599105 0.16229
H  -2.811889 -1.052165 3.552101
H  -4.614214 -2.454518 2.468652
H  6.05057 0.736317 1.322638
H  4.785864 -3.012819 -0.475649
